{"text_format":"1","workbook":"xlsx","n_sheets":23,"sheets":["Menu","Help","OffSets","Graphic","PigNo","Report","PigMovements","FarmDesign","Energy Entry","GrowthCurve","Genetics","UserAssumotions","Const","Assumption","PigDetails","MMSSum","MMS1","MMS2","MMS3","MMS4","MMS5","FeedRaws","Feeds"],"not_rendered":{"charts":4,"images":14,"macros":1,"external_links":0,"defined_names":55,"comments":1,"pivot_tables":0},"unopened":[],"bounds":{"document_bytes":16777216,"sheet_cells":100000,"rows_first":2000,"rows_last":500,"rows_between":2000,"halvings":0,"cell_chars":16384,"cell_head_chars":4096},"cells_cut":0,"cells_raw":0,"read":"whole","date_system":"1900"}

{"sheet":"Menu","index":0,"n_rows":93,"n_cols":12,"rows_kept":93,"cut":false,"hidden":false,"merged":[[0,0,0,16],[28,12,28,13],[11,3,12,4],[2,8,7,10],[3,11,4,13],[5,11,6,13],[26,12,26,13],[27,12,27,13],[26,3,26,4],[27,3,27,4],[28,3,28,4]]}
["Pork Industry Greenhouse Gas Calculator     Version 1.02.04"]
[]
[null,null,null,null,null,null,null,"PigGAS"]
[null,null,null,null,null,null,null,null,null,null,null,{"$f":"LEFT(FarmDesign!H9,25)","v":"Harry's Happy Hogs"}]
[]
[null,null,null,null,null,null,null,null,null,null,null,{"$f":"LEFT(FarmDesign!H11,25)","v":"1000 sow multisite"}]
[]
[]
{"$rows_left_out":86}
{"sheet":"Help","index":1,"n_rows":107,"n_cols":8,"rows_kept":107,"cut":false,"hidden":false,"merged":[[3,7,11,13],[12,3,14,13]]}
[]
[]
[]
[null,null,null,null,null,null,null,"HELP MAP"]
[]
[]
[]
[]
{"$rows_left_out":100}
{"sheet":"OffSets","index":2,"n_rows":31,"n_cols":15,"rows_kept":31,"cut":false,"hidden":false,"merged":[[6,4,6,15],[5,5,5,14]]}
[null,null,null,null,null,{"$f":"IF(F8=0,\"*\",\"\")","v":""},{"$f":"IF(G8=0,\"*\",\"\")","v":""},"","*","*","*","*","*","*","*"]
[]
[]
[]
[]
[null,null,null,null,null,"Offset kg CO-e"]
[null,null,null,null,{"$f":"FarmDesign!H9","v":"Harry's Happy Hogs"}]
[null,null,null,"Comment",null,{"$f":"FarmDesign!E14","v":"Breeder"},{"$f":"FarmDesign!E15","v":"Weaner"},{"$f":"FarmDesign!E16","v":"GrowOut"},{"$f":"FarmDesign!E17","v":0},{"$f":"FarmDesign!E18","v":0},{"$f":"FarmDesign!E19","v":0},{"$f":"FarmDesign!E20","v":0},{"$f":"FarmDesign!E21","v":0},{"$f":"FarmDesign!E22","v":0},{"$f":"FarmDesign!E23","v":0}]
{"$rows_left_out":24}
{"sheet":"Graphic","index":3,"n_rows":108,"n_cols":75,"rows_kept":108,"cut":false,"hidden":false,"merged":[[67,6,67,21],[23,11,24,15],[21,16,22,19],[27,16,28,19],[23,16,24,19],[4,55,5,63],[8,50,8,51],[9,50,9,51],[10,50,10,51],[12,50,12,51],[14,50,14,51],[7,50,7,51],[19,52,20,61],[9,46,9,47],[9,48,9,49],[10,46,10,47],[10,48,10,49],[7,62,7,63],[7,60,7,61],[7,58,7,59],[9,58,9,59],[9,62,9,63],[10,58,10,59],[11,58,11,59],[43,9,44,15],[35,9,36,10],[37,9,38,10],[9,60,9,61],[10,60,10,61],[11,60,11,61],[10,62,10,63],[11,62,11,63],[22,60,22,61],[22,56,22,57],[22,58,22,59],[21,9,22,15],[39,9,40,10],[26,26,26,27],[26,24,26,25],[41,9,42,10],[29,11,30,15],[31,11,32,15],[33,11,34,15],[35,11,36,15],[37,11,38,15],[39,11,40,15],[27,11,28,15],[25,11,26,15],[52,58,55,62],[23,56,23,57],[26,60,26,61],[43,57,43,62],[44,57,44,58],[44,59,44,60],[44,61,44,62],[47,57,47,58],[47,59,47,60],[47,61,47,62],[23,60,23,61],[24,60,24,61],[24,56,24,57],[24,58,24,59],[46,43,46,48],[44,54,44,55],[45,54,45,55],[43,50,43,55],[47,38,47,39],[47,40,47,41],[47,24,47,25],[35,37,35,38],[47,50,47,51],[47,52,47,53],[44,26,44,27],[47,26,47,27],[47,29,47,30],[47,54,47,55],[47,36,47,37],[47,47,47,48],[44,50,44,51],[44,52,44,53],[47,43,47,44],[47,45,47,46],[45,38,45,39],[45,40,45,41],[44,36,44,37],[45,36,45,37],[33,16,34,19],[31,16,32,19],[29,16,30,19],[26,28,26,29],[27,28,27,29],[60,51,63,62],[45,57,45,58],[45,59,45,60],[45,61,45,62],[60,33,63,46],[46,29,46,34],[46,22,46,27],[46,36,46,41],[45,24,45,25],[44,29,44,30],[44,31,44,32],[44,33,44,34],[45,29,45,30],[45,31,45,32],[45,33,45,34],[44,22,44,23],[44,45,44,46],[52,51,55,54],[27,52,27,55],[28,52,28,55],[25,56,25,57],[24,24,25,29],[14,46,14,47],[14,48,14,49],[19,35,20,42],[23,58,23,59],[28,23,28,29],[27,24,27,25],[27,26,27,27],[51,25,52,27],[52,44,55,47],[47,22,47,23],[45,22,45,23],[47,31,47,32],[47,33,47,34],[3,65,6,65],[27,65,30,65],[37,65,40,65],[33,53,35,59],[18,20,19,33],[20,20,21,33],[35,39,35,40],[29,24,29,25],[27,60,27,61],[28,56,28,57],[28,58,28,59],[28,60,28,61],[23,52,23,55],[24,52,24,55],[25,52,25,55],[26,52,26,55],[14,21,14,23],[10,21,10,23],[44,24,44,25],[12,48,12,49],[22,45,22,48],[21,41,21,44],[10,34,12,36],[10,32,12,33],[10,37,12,38],[22,41,22,44],[11,21,11,23],[14,28,14,29],[14,26,14,27],[12,24,12,25],[12,26,12,27],[14,24,14,25],[10,26,10,27],[12,21,12,23],[11,28,11,29],[11,26,11,27],[11,24,11,25],[12,28,12,29],[13,21,13,23],[10,28,10,29],[45,43,45,44],[45,45,45,46],[34,35,34,36],[34,37,34,38],[29,26,29,27],[12,46,12,47],[44,43,44,44],[21,45,21,48],[43,43,43,48],[36,35,36,36],[36,37,36,38],[36,39,36,40],[23,41,24,44],[23,45,24,48],[22,37,22,40],[23,34,24,36],[23,37,24,40],[43,36,43,41],[44,38,44,39],[44,40,44,41],[34,39,34,40],[35,35,35,36],[4,21,5,29],[4,43,5,53],[4,32,5,40],[7,46,7,47],[7,48,7,49],[8,46,8,47],[8,48,8,49],[8,39,8,40],[9,39,9,40],[9,26,9,27],[6,34,6,36],[8,34,8,36],[7,26,7,27],[8,26,8,27],[8,28,8,29],[7,28,7,29],[9,35,9,36],[9,37,9,38],[8,21,8,23],[7,24,7,25],[9,28,9,29],[2,9,11,19],[12,9,14,19],[46,57,46,62],[25,58,25,59],[25,60,25,61],[26,56,26,57],[26,58,26,59],[9,21,9,23],[6,39,6,40],[7,39,7,40],[45,50,45,51],[45,52,45,53],[46,50,46,55],[44,47,44,48],[10,39,12,40],[8,24,8,25],[9,24,9,25],[10,24,10,25],[45,47,45,48],[12,43,12,45],[19,9,20,19],[6,37,6,38],[7,37,7,38],[8,37,8,38],[45,9,46,19],[29,28,29,29],[34,32,34,34],[31,32,32,39],[33,35,33,36],[33,37,33,38],[33,39,33,40],[21,37,21,40],[33,9,34,10],[31,9,32,10],[29,9,30,10],[25,9,26,10],[25,16,26,19],[43,16,44,19],[45,26,45,27],[43,22,43,27],[43,29,43,34],[23,9,24,10],[27,9,28,10],[41,11,42,15],[41,16,42,19],[39,16,40,19],[37,16,38,19],[35,16,36,19]]}
[null,null,null,null,null,null,null,null,null,null,null,null,null,null,null,null,null,null,null,null,null,null,null,null,null,null,null,null,null,null,null,null,null,null,null,null,null,null,null,null,null,null,null,null,null,null,null,null,null,null,null,null,null,null,null,null,null,null,null,null,null,null,0,null,null,null,null,null,null,0]
[]
[null,null,null,null,null,null,null,null,null,"PigGas"]
[null,null,null,null,null,null,null,null,null,null,null,null,null,null,null,null,null,null,null,null,null,null,null,null,null,null,null,null,null,null,null,null,null,null,null,null,null,null,null,null,null,null,null,null,null,null,null,null,null,null,null,null,null,null,null,null,null,null,null,null,null,null,null,null,null,"On Farm Emissions"]
[null,null,null,null,null,null,null,null,null,null,null,null,null,null,null,null,null,null,null,null,null,"Pre Farm Emissions",null,null,null,null,null,null,null,null,null,null,"Total Emissions",null,null,null,null,null,null,null,null,null,null,"Post Farm Emissions",null,null,null,null,null,null,null,null,null,null,null,"Exported Manure",null,null,null,null,null,null,null,null,null,null,null,null,null,null,"Count =",{"$f":"COUNT(BT9:BT36)","v":20},{"$f":"COUNT(BU9:BU36)","v":20}]
[]
[null,null,null,null,null,null,null,null,null,null,null,null,null,null,null,null,null,null,null,null,null,null,null,null,null,null,null,null,null,null,null,null,null,null,"Baseline",null,null,"Scenario",null,"Dif",null,null,null,null,null,null,null,null,null,null,null,null,null,null,null,null,null,null,null,null,null,null,null,null,null,null,null,null,null,null,"Item","Baseline","Scenario"]
[null,null,null,null,null,null,null,null,null,null,null,null,null,null,null,null,null,null,null,null,null,null,null,null,"Baseline",null,"Scenario",null,"Dif",null,null,null,null,null,null,null,null,null,null,null,null,null,null,null,null,null,"Baseline",null,"Scenario",null,"Dif",null,null,null,null,null,null,null,"Baseline",null,"Scenario",null,"Dif",null,null,null,null,null,null,null,"Prefarm"]
{"$rows_left_out":101}
{"sheet":"PigNo","index":4,"n_rows":19,"n_cols":16,"rows_kept":19,"cut":false,"hidden":false,"merged":[[5,5,5,15],[3,4,3,15]]}
[]
[]
[]
[null,null,null,null,{"$f":"\"Livestock Numbers  -  \"&FarmDesign!H9","v":"Livestock Numbers  -  Harry's Happy Hogs"}]
[]
[null,null,null,null,null,"Unit"]
[null,null,null,null,null,1,2,3,4,5,6,7,8,9,10]
[null,null,null,null,"Category",{"$f":"INDEX(FarmDesign!$E$14:$E$23,PigNo!F7)","v":"Breeder"},{"$f":"INDEX(FarmDesign!$E$14:$E$23,PigNo!G7)","v":"Weaner"},{"$f":"INDEX(FarmDesign!$E$14:$E$23,PigNo!H7)","v":"GrowOut"},{"$f":"INDEX(FarmDesign!$E$14:$E$23,PigNo!I7)","v":0},{"$f":"INDEX(FarmDesign!$E$14:$E$23,PigNo!J7)","v":0},{"$f":"INDEX(FarmDesign!$E$14:$E$23,PigNo!K7)","v":0},{"$f":"INDEX(FarmDesign!$E$14:$E$23,PigNo!L7)","v":0},{"$f":"INDEX(FarmDesign!$E$14:$E$23,PigNo!M7)","v":0},{"$f":"INDEX(FarmDesign!$E$14:$E$23,PigNo!N7)","v":0},{"$f":"INDEX(FarmDesign!$E$14:$E$23,PigNo!O7)","v":0},"Total"]
{"$rows_left_out":12}
{"sheet":"Report","index":5,"n_rows":92,"n_cols":18,"rows_kept":92,"cut":false,"hidden":false,"merged":[[2,2,6,5],[2,6,3,18],[4,6,4,17]]}
[null,null,null,null,null,null,{"$f":"IF(G7=0,\"*\",\"\")","v":""},{"$f":"IF(H7=0,\"*\",\"\")","v":""},"","*","*","*","*","*","*","*"]
[]
[null,null,"PigGas",null,null,null,{"$f":"FarmDesign!H9","v":"Harry's Happy Hogs"}]
[]
[null,null,null,null,null,null,{"$f":"FarmDesign!H11","v":"1000 sow multisite"}]
[null,null,null,null,null,null,1,2,3,4,5,6,7,8,9,10,null,"Total"]
[null,null,null,null,null,null,{"$f":"INDEX(UnitName,G6)","v":"Breeder"},"Weaner","GrowOut",0,0,0,0,0,0,0]
[]
{"$rows_left_out":85}
{"sheet":"PigMovements","index":6,"n_rows":262,"n_cols":46,"rows_kept":262,"cut":false,"hidden":false,"merged":[[2,10,5,22]]}
["Calc",false]
["Monthly",false]
["Year",true,null,null,null,null,null,null,null,null,"Pig Movements"]
[]
[]
[]
[]
[null,null,null,null,null,"SALES"]
{"$rows_left_out":255}
{"sheet":"FarmDesign","index":7,"n_rows":23,"n_cols":14,"rows_kept":23,"cut":false,"hidden":false,"merged":[[14,4,14,6],[15,4,15,6],[16,4,16,6],[19,4,19,6],[14,13,14,14],[15,13,15,14],[16,13,16,14],[17,13,17,14],[18,13,18,14],[20,4,20,6],[22,13,22,14],[17,4,17,6],[18,4,18,6],[22,4,22,6],[21,4,21,6],[20,13,20,14],[21,13,21,14],[19,13,19,14],[12,3,12,6],[2,6,5,15],[8,7,8,12],[13,13,13,14],[12,12,12,14],[13,4,13,6],[10,7,10,12],[6,7,6,9]]}
[]
[]
[null,null,null,null,null,null,"Farm Details"]
[]
[]
[]
[null,null,null,null,"Select State",null,null,"NSW"]
[]
{"$rows_left_out":16}
{"sheet":"Energy Entry","index":8,"n_rows":57,"n_cols":21,"rows_kept":57,"cut":false,"hidden":false,"merged":[[2,3,4,10]]}
[]
[]
[null,null,null,"ON FARM ENERGY USE"]
[null,null,null,null,null,null,null,null,null,null,null,null,null,null,"*","*","*","*","*","*","*"]
[]
[]
[null,null,null,"#","Code","Unit","Type","Units",null,"Notes","kg CO2-e",null,null,null,null,null,null,null,"Unit","Code"]
[null,null,null,1,{"$f":"IF(ISBLANK(G8),\"\",VLOOKUP(G8,$P$7:$T$17,5,FALSE)&F8)","v":"EBreeder"},"Breeder","Purchased Electricity",315000,{"$f":"IF(G8<>\"\",VLOOKUP(G8,$P$8:$S$17,4,FALSE),\"\")","v":"kWh"},null,{"$f":"IF(ISBLANK(G8),\"\",VLOOKUP(G8,$P$8:$Q$17,2,FALSE)*H8)","v":280350},null,null,null,null,"Purchased Electricity",{"$f":"VLOOKUP(HomeState,Electricity,2,FALSE)","v":0.89},"kgCOe2/kWh","kWh","E"]
{"$rows_left_out":50}
{"sheet":"GrowthCurve","index":9,"n_rows":71,"n_cols":37,"rows_kept":71,"cut":false,"hidden":false,"merged":[[2,9,5,23],[17,7,17,9],[17,10,17,12],[17,13,17,15],[17,16,17,18],[17,34,17,36],[17,19,17,21],[17,22,17,24],[17,25,17,27],[17,28,17,30],[17,31,17,33]]}
[]
[]
[null,null,null,null,null,null,null,null,null,"Pig Feed kg & Growth Curves"]
[null,null,null,"Selected Geonotype",null,{"$f":"MATCH(Genetics!F6,Genetics!L7:L16,0)","v":10}]
[]
[]
[]
[null,null,null,"Age (d) In",120]
{"$rows_left_out":64}
{"sheet":"Genetics","index":10,"n_rows":30,"n_cols":63,"rows_kept":30,"cut":false,"hidden":false,"merged":[[3,17,3,19],[17,17,17,19],[5,5,5,8],[3,13,3,15],[17,13,17,15],[3,5,4,8]]}
[null,null,null,null,null,null,null,null,null,null,null,null,null,null,null,null,null,null,null,null,null,null,null,null,null,null,null,null,null,null,null,null,null,null,null,null,null,null,null,null,null,null,null,null,null,null,null,null,null,null,null,null,null,null,null,null,null,null,null,null,null,null,0]
[]
[]
[null,null,null,null,null,"Select Pig Performance",null,null,null,null,null,null,null,"Wt (kg) @ days",null,null,null,"Growth Rate"]
[null,null,null,null,null,null,null,null,null,null,null,null,"              "]
[null,null,null,null,null,"GenoType 10",null,null,null,null,null,null,"Age in days =>",80,null,161,null,{"$f":"N6","v":80},null,{"$f":"P6","v":161}]
[null,null,null,null,null,null,null,null,null,null,null,{"$f":"GrowthCurve!$H$18","v":"GenoType 1"},null,{"$f":"VLOOKUP(N$6,GrowthCurve!$H$20:$J$71,2,TRUE)","v":{"$error":"#N/A"}},null,{"$f":"VLOOKUP(P$6,GrowthCurve!$H$20:$J$71,2,TRUE)","v":{"$error":"#N/A"}},null,{"$f":"N7/N$6*1000","v":{"$error":"#N/A"}},null,{"$f":"P7/P$6*1000","v":{"$error":"#N/A"}}]
[null,null,null,null,null,null,null,null,null,null,null,{"$f":"GrowthCurve!$K$18","v":"GenoType 2"},null,{"$f":"VLOOKUP(N$6,GrowthCurve!$K$20:$M$71,2,TRUE)","v":{"$error":"#N/A"}},null,{"$f":"VLOOKUP(P$6,GrowthCurve!$K$20:$M$71,2,TRUE)","v":{"$error":"#N/A"}},null,{"$f":"N8/N$6*1000","v":{"$error":"#N/A"}},null,{"$f":"P8/P$6*1000","v":{"$error":"#N/A"}}]
{"$rows_left_out":23}
{"sheet":"UserAssumotions","index":11,"n_rows":57,"n_cols":10,"rows_kept":57,"cut":false,"hidden":false,"merged":[[2,3,4,9]]}
[]
[]
[null,null,null,"Assumptions"]
[]
[]
[]
[null,null,null,"Pre Farm"]
[]
{"$rows_left_out":50}
{"sheet":"Const","index":12,"n_rows":7,"n_cols":7,"rows_kept":7,"cut":false,"hidden":false,"merged":[]}
[]
[null,"FracLEACH",0.3,"Eq 4D3_5 (DCCEE 2012)"]
[null,"EFLRO",1.2500000000000001E-2,"Eq 4D3_7 (DCCEE 2012)"]
[]
[]
[null,"EmmPot",0.45,"Emmissions Potential",null,null,"Eq 4B.8_1 (DCCEE 2012) - IPCC "]
[null,"DensCH4",0.66200000000000003,"Density of Methane",null,null,"Eq 4B.8_1 (DCCEE 2012) "]

{"sheet":"Assumption","index":13,"n_rows":124,"n_cols":9,"rows_kept":124,"cut":false,"hidden":false,"merged":[[99,1,99,9],[113,4,113,7],[86,1,86,4],[12,1,12,2],[1,1,2,1],[43,3,43,7],[37,3,37,7],[73,1,74,1],[73,2,73,6],[73,7,74,7],[100,1,100,9]]}
[null,null,null,"Table 26 (DCCEE 2011a) Global warming potentials"]
[null,"State",null,"Global Warming Conversion Factors",null,null,"Range names"]
[null,null,null,"Carbon Dioxide","CO2 ",1,"CFCO2"]
[null,"ACT",null,"Methane","CH4 ",21,"CFCH4"]
[null,"NSW",null,"Nitrous Oxide","N2O",310,"CFN20"]
[null,"Tasmania"]
[null,"Western Australia"]
[null,"South Australia",null,null,"References"]
{"$rows_left_out":117}
{"sheet":"PigDetails","index":14,"n_rows":121,"n_cols":57,"rows_kept":121,"cut":false,"hidden":false,"merged":[[9,3,9,4],[8,3,8,4],[3,7,7,14],[5,32,6,32],[5,33,6,33],[4,31,4,33],[5,3,5,4],[5,17,5,19],[5,31,6,31]]}
[]
[]
[]
[null,null,null,null,null,null,null,"PIG DETAILS"]
[]
[]
[]
[]
{"$rows_left_out":114}
{"sheet":"MMSSum","index":15,"n_rows":69,"n_cols":27,"rows_kept":69,"cut":false,"hidden":false,"merged":[[3,5,3,12],[11,4,11,8],[13,4,13,8],[15,4,15,8],[17,3,17,4],[7,4,7,8],[9,4,9,8]]}
[]
[]
[]
[null,null,null,null,null,"Manure Management Systems"]
[]
[null,null,null,null,null,null,null,null,"CO2-e",null,"CH4",null,"N2O",null,null,null,null,null,null,null,"CH4","N2O Dir.","N2O Vol.","N2O LRO","N20Soil","Export CH4","Export N2O"]
[]
[null,null,null,null,{"$f":"'MMS1'!$I$7","v":"Ponds I"},null,null,null,null,null,{"$f":"IF(ISERROR(U8),\"…….\",U8)","v":4.7998392750000001},null,{"$f":"IF( ISERROR(SUM(V8:Y8)),\"…….\",SUM(V8:Y8))","v":6.1763185049107134},null,null,null,null,null,{"$f":"'MMS1'!$I$7","v":"Ponds I"},"MMS1",{"$f":"'MMS1'!$M$10","v":4.7998392750000001},{"$f":"'MMS1'!$M$11","v":0.94992857142857146},{"$f":"'MMS1'!$M$12","v":1.9607499999999998},{"$f":"'MMS1'!$M$13","v":0.36446064776785708},{"$f":"'MMS1'!$M$14","v":2.9011792857142855},{"$f":"'MMS1'!$M$18","v":0},{"$f":"'MMS1'!$M$16","v":0}]
{"$rows_left_out":62}
{"sheet":"MMS1","index":16,"n_rows":65,"n_cols":27,"rows_kept":65,"cut":false,"hidden":false,"merged":[[15,8,17,9],[3,5,4,12],[6,8,6,12],[43,8,44,8],[52,8,53,8],[6,5,6,6],[19,5,19,6],[21,5,21,6],[31,5,31,6],[35,5,35,6],[37,5,37,6],[41,5,41,6],[46,5,46,6],[50,5,50,6],[19,8,19,10],[21,8,21,12],[31,8,31,12],[26,8,27,12],[29,6,29,10],[33,8,33,10],[23,8,24,12],[57,8,57,10],[35,8,35,12],[41,8,41,12],[37,8,37,12],[39,8,39,10],[55,5,55,6],[46,8,46,12],[50,8,50,12],[55,8,55,12],[48,8,48,10]]}
["Hide"]
[null,null,null,null,null,null,null,null,null,null,null,null,null,null,null,null,null,null,null,null,"4B.8_1","4B.8_4","4B.1.a_10c",null,"4D3_6","4D3_6"]
[null,null,null,null,null,null,null,null,null,null,null,null,null,null,null,null,null,null,null,null,null,null,"4D3_4",null,null,"4D3_7"]
[null,null,null,null,null,"Manure Management System 1",null,null,null,null,null,null,null,null,null,null,null,null,null,null,"MMS-VS","MMS Direct","MMS -N Vol","Residual","LRO ","LRO","SOIL N20"]
[null,null,null,null,null,null,null,null,null,null,null,null,null,null,null,null,null,null,"MMS","MCF","CH4","N2O","N2O","N","N","N2O","N2O"]
[]
[null,null,null,null,null,"MMS1 Name",null,null,"Ponds I"]
[]
{"$rows_left_out":58}
{"sheet":"MMS2","index":17,"n_rows":65,"n_cols":27,"rows_kept":65,"cut":false,"hidden":false,"merged":[[57,8,57,10],[46,5,46,6],[46,8,46,12],[48,8,48,10],[52,8,53,8],[55,5,55,6],[55,8,55,12],[50,5,50,6],[50,8,50,12],[35,8,35,12],[37,5,37,6],[37,8,37,12],[39,8,39,10],[43,8,44,8],[41,5,41,6],[41,8,41,12],[35,5,35,6],[26,8,27,12],[29,6,29,10],[31,5,31,6],[31,8,31,12],[33,8,33,10],[21,5,21,6],[21,8,21,12],[23,8,24,12],[3,5,4,12],[6,5,6,6],[6,8,6,12],[15,8,17,9],[19,5,19,6],[19,8,19,10]]}
["Hide"]
[null,null,null,null,null,null,null,null,null,null,null,null,null,null,null,null,null,null,null,null,"4B.8_1","4B.8_4","4B.1.a_10c",null,"4D3_6","4D3_6"]
[null,null,null,null,null,null,null,null,null,null,null,null,null,null,null,null,null,null,null,null,null,null,"4D3_4",null,null,"4D3_7"]
[null,null,null,null,null,"Manure Management System 1",null,null,null,null,null,null,null,null,null,null,null,null,null,null,"MMS-VS","MMS Direct","MMS -N Vol","Residual","LRO ","LRO","SOIL N20"]
[null,null,null,null,null,null,null,null,null,null,null,null,null,null,null,null,null,null,"MMS","MCF","CH4","N2O","N2O","N","N","N2O","N2O"]
[]
[null,null,null,null,null,"MMS2 Name",null,null,"Straw Igloo"]
[]
{"$rows_left_out":58}
{"sheet":"MMS3","index":18,"n_rows":65,"n_cols":27,"rows_kept":65,"cut":false,"hidden":false,"merged":[[57,8,57,10],[46,5,46,6],[46,8,46,12],[48,8,48,10],[52,8,53,8],[55,5,55,6],[55,8,55,12],[50,5,50,6],[50,8,50,12],[35,8,35,12],[37,5,37,6],[37,8,37,12],[39,8,39,10],[43,8,44,8],[41,5,41,6],[41,8,41,12],[35,5,35,6],[26,8,27,12],[29,6,29,10],[31,5,31,6],[31,8,31,12],[33,8,33,10],[21,5,21,6],[21,8,21,12],[23,8,24,12],[3,5,4,12],[6,5,6,6],[6,8,6,12],[15,8,17,9],[19,5,19,6],[19,8,19,10]]}
["Hide"]
[null,null,null,null,null,null,null,null,null,null,null,null,null,null,null,null,null,null,null,null,"4B.8_1","4B.8_4","4B.1.a_10c",null,"4D3_6","4D3_6"]
[null,null,null,null,null,null,null,null,null,null,null,null,null,null,null,null,null,null,null,null,null,null,"4D3_4",null,null,"4D3_7"]
[null,null,null,null,null,"Manure Management System 1",null,null,null,null,null,null,null,null,null,null,null,null,null,null,"MMS-VS","MMS Direct","MMS -N Vol","Residual","LRO ","LRO","SOIL N20"]
[null,null,null,null,null,null,null,null,null,null,null,null,null,null,null,null,null,null,"MMS","MCF","CH4","N2O","N2O","N","N","N2O","N2O"]
[]
[null,null,null,null,null,"MMS3 Name",null,null,"Ponds II"]
[]
{"$rows_left_out":58}
{"sheet":"MMS4","index":19,"n_rows":65,"n_cols":27,"rows_kept":65,"cut":false,"hidden":false,"merged":[[57,8,57,10],[46,5,46,6],[46,8,46,12],[48,8,48,10],[52,8,53,8],[55,5,55,6],[55,8,55,12],[50,5,50,6],[50,8,50,12],[35,8,35,12],[37,5,37,6],[37,8,37,12],[39,8,39,10],[43,8,44,8],[41,5,41,6],[41,8,41,12],[35,5,35,6],[26,8,27,12],[29,6,29,10],[31,5,31,6],[31,8,31,12],[33,8,33,10],[21,5,21,6],[21,8,21,12],[23,8,24,12],[3,5,4,12],[6,5,6,6],[6,8,6,12],[15,8,17,9],[19,5,19,6],[19,8,19,10]]}
["Hide"]
[null,null,null,null,null,null,null,null,null,null,null,null,null,null,null,null,null,null,null,null,"4B.8_1","4B.8_4","4B.1.a_10c",null,"4D3_6","4D3_6"]
[null,null,null,null,null,null,null,null,null,null,null,null,null,null,null,null,null,null,null,null,null,null,"4D3_4",null,null,"4D3_7"]
[null,null,null,null,null,"Manure Management System 1",null,null,null,null,null,null,null,null,null,null,null,null,null,null,"MMS-VS","MMS Direct","MMS -N Vol","Residual","LRO ","LRO","SOIL N20"]
[null,null,null,null,null,null,null,null,null,null,null,null,null,null,null,null,null,null,"MMS","MCF","CH4","N2O","N2O","N","N","N2O","N2O"]
[]
[null,null,null,null,null,"MMS4 Name",null,null,"Not Used"]
[]
{"$rows_left_out":58}
{"sheet":"MMS5","index":20,"n_rows":65,"n_cols":27,"rows_kept":65,"cut":false,"hidden":false,"merged":[[57,8,57,10],[46,5,46,6],[46,8,46,12],[48,8,48,10],[52,8,53,8],[55,5,55,6],[55,8,55,12],[50,5,50,6],[50,8,50,12],[35,8,35,12],[37,5,37,6],[37,8,37,12],[39,8,39,10],[43,8,44,8],[41,5,41,6],[41,8,41,12],[35,5,35,6],[26,8,27,12],[29,6,29,10],[31,5,31,6],[31,8,31,12],[33,8,33,10],[21,5,21,6],[21,8,21,12],[23,8,24,12],[3,5,4,12],[6,5,6,6],[6,8,6,12],[15,8,17,9],[19,5,19,6],[19,8,19,10]]}
["Hide"]
[null,null,null,null,null,null,null,null,null,null,null,null,null,null,null,null,null,null,null,null,"4B.8_1","4B.8_4","4B.1.a_10c",null,"4D3_6","4D3_6"]
[null,null,null,null,null,null,null,null,null,null,null,null,null,null,null,null,null,null,null,null,null,null,"4D3_4",null,null,"4D3_7"]
[null,null,null,null,null,"Manure Management System 1",null,null,null,null,null,null,null,null,null,null,null,null,null,null,"MMS-VS","MMS Direct","MMS -N Vol","Residual","LRO ","LRO","SOIL N20"]
[null,null,null,null,null,null,null,null,null,null,null,null,null,null,null,null,null,null,"MMS","MCF","CH4","N2O","N2O","N","N","N2O","N2O"]
[]
[null,null,null,null,null,"MMS5 Name",null,null,"Not Used"]
[]
{"$rows_left_out":58}
{"sheet":"FeedRaws","index":21,"n_rows":202,"n_cols":27,"rows_kept":202,"cut":false,"hidden":false,"merged":[[4,5,4,6],[2,5,2,19],[141,25,141,26],[3,15,3,18],[3,7,3,14],[141,5,141,18],[127,5,127,18],[121,5,121,18],[116,5,116,18],[110,5,110,18],[102,5,102,18],[97,5,97,18],[95,5,95,18],[90,5,90,18],[79,5,79,18],[76,5,76,18],[25,5,25,18],[23,5,23,18],[15,5,15,18],[5,5,5,18],[69,5,69,18],[57,5,57,18],[54,5,54,18],[40,5,40,18],[32,5,32,18]]}
[]
[]
[null,null,null,null,null,"Ingredient List"]
[null,null,null,null,null,null,null,"REQUIRED",null,null,null,null,null,null,null,"OPTIONAL"]
[null,"Code",null,null,null,"As-fed basis",null,"DM (%)","GE (MJ/kg)","DE (MJ/kg)","DMD %*","Crude Protein %","N (%)","Crude Fibre %","Ash (%)","Total Phos (%)","Phos availability (%)","Avail Phos (%)","K(%)","CO2 -e  (kg/kg CO2 -e)"]
[null,null,null,null,null,"Cereal Grains"]
[null,"Brl11",null,null,null,null,"Barley 11",88,16,12.8,{"$f":"J7/I7","v":0.8},11,{"$f":"L7/6.25","v":1.76},4.55,2.25,0.36,35,{"$f":"Q7/100*P7","v":0.126},0.47,0.37]
[null,"Grts",null,null,null,null,"Groats",90,16.059999999999999,15,0.93399750933997516,11,1.76,1.8,2.14,0.3,32,{"$f":"Q8/100*P8","v":9.6000000000000002E-2},0.35]
{"$rows_left_out":195}
{"sheet":"Feeds","index":22,"n_rows":234,"n_cols":45,"rows_kept":234,"cut":false,"hidden":false,"merged":[[77,3,82,3],[65,3,75,3],[11,3,11,4],[11,5,11,8],[110,3,116,3],[105,3,108,3],[98,3,101,3],[87,3,96,3],[84,3,85,3],[149,3,208,3],[135,3,147,3],[129,3,133,3],[124,3,127,3],[118,3,122,3],[6,5,6,8],[6,9,6,12],[6,13,6,16],[6,17,6,20],[11,25,11,28],[7,5,7,8],[7,9,7,12],[7,13,7,16],[7,17,7,20],[7,21,7,24],[11,9,11,12],[11,13,11,16],[6,25,6,28],[6,29,6,32],[6,33,6,36],[11,17,11,20],[11,21,11,24],[6,21,6,24],[11,29,11,32],[6,37,6,40],[6,41,6,44],[62,3,63,3],[48,3,60,3],[40,3,46,3],[33,3,38,3],[7,41,7,44],[7,25,7,28],[7,29,7,32],[7,33,7,36],[7,37,7,40],[23,3,29,3],[13,3,21,3],[11,33,11,36],[11,37,11,40],[11,41,11,44]]}
[]
[]
[]
[null,null,null,null,"Mix Total (100 for %)",100]
[]
[]
[null,null,null,null,null,1,null,null,null,2,null,null,null,3,null,null,null,4,null,null,null,5,null,null,null,6,null,null,null,7,null,null,null,8,null,null,null,9,null,null,null,10]
[null,null,null,null,null,{"$f":"INDEX(Feeds,F7)","v":"Sucker"},null,null,null,{"$f":"INDEX(Feeds,J7)","v":"Weaner"},null,null,null,{"$f":"INDEX(Feeds,N7)","v":"Grower"},null,null,null,{"$f":"INDEX(Feeds,R7)","v":"Finisher"},null,null,null,{"$f":"INDEX(Feeds,V7)","v":"LacSow"},null,null,null,{"$f":"INDEX(Feeds,Z7)","v":"DrySow"},null,null,null,{"$f":"INDEX(Feeds,AD7)","v":0},null,null,null,{"$f":"INDEX(Feeds,AH7)","v":0},null,null,null,{"$f":"INDEX(Feeds,AL7)","v":0},null,null,null,{"$f":"INDEX(Feeds,AP7)","v":0}]
{"$rows_left_out":226}