{"text_format":"1","workbook":"xlsx","n_sheets":23,"sheets":["Menu","Help","OffSets","Graphic","PigNo","Report","PigMovements","FarmDesign","Energy Entry","GrowthCurve","Genetics","UserAssumotions","Const","Assumption","PigDetails","MMSSum","MMS1","MMS2","MMS3","MMS4","MMS5","FeedRaws","Feeds"],"not_rendered":{"charts":4,"images":14,"macros":1,"external_links":0,"defined_names":55,"comments":1,"pivot_tables":0},"unopened":[],"bounds":{"document_bytes":16777216,"sheet_cells":100000,"rows_first":2000,"rows_last":500,"rows_between":2000,"halvings":0,"cell_chars":16384,"cell_head_chars":4096},"cells_cut":0,"cells_raw":0,"read":"whole","date_system":"1900"}

{"sheet":"Menu","index":0,"n_rows":93,"n_cols":12,"rows_kept":93,"cut":false,"hidden":false,"merged":[[0,0,0,16],[28,12,28,13],[11,3,12,4],[2,8,7,10],[3,11,4,13],[5,11,6,13],[26,12,26,13],[27,12,27,13],[26,3,26,4],[27,3,27,4],[28,3,28,4]]}
["Pork Industry Greenhouse Gas Calculator     Version 1.02.04"]
[]
[null,null,null,null,null,null,null,"PigGAS"]
[null,null,null,null,null,null,null,null,null,null,null,{"$f":"LEFT(FarmDesign!H9,25)","v":"Harry's Happy Hogs"}]
[]
[null,null,null,null,null,null,null,null,null,null,null,{"$f":"LEFT(FarmDesign!H11,25)","v":"1000 sow multisite"}]
[]
[]
[]
[]
[]
[]
[]
[]
[]
[]
[]
[]
[]
[]
[]
[]
[]
[]
[]
[]
[null,null,null,"Developed By"]
[null,null,null,"Greg Mills & Ian Kruger"]
[null,null,null,"NSW Department of\nPrimary Industries"]
[]
[]
[]
[]
[]
[]
[]
[]
[]
[]
[]
[]
[]
[]
[]
[]
[]
[]
[]
[]
[]
[]
[]
[]
[]
[]
[]
[]
[]
[]
[]
[]
[]
[]
[]
[]
[]
[]
[]
[]
[]
[]
[]
[]
[]
[]
[]
[]
[]
[]
[]
[]
[]
[]
[]
[]
[]
[]
[]
[]
[]
[]
[]
[null,null,null,null,null,null,1]

{"sheet":"Help","index":1,"n_rows":107,"n_cols":8,"rows_kept":107,"cut":false,"hidden":false,"merged":[[3,7,11,13],[12,3,14,13]]}
[]
[]
[]
[null,null,null,null,null,null,null,"HELP MAP"]
[]
[]
[]
[]
[]
[]
[]
[]
[null,null,null,"CLICK ON BOXES TO ZOOM IN & OUT"]
[]
[]
[]
[]
[]
[]
[]
[]
[]
[]
[]
[]
[]
[]
[]
[]
[]
[]
[]
[]
[]
[]
[]
[]
[]
[]
[]
[]
[]
[]
[]
[]
[]
[]
[]
[]
[]
[]
[]
[]
[]
[]
[]
[]
[]
[]
[]
[]
[]
[]
[]
[]
[]
[]
[]
[]
[]
[]
[]
[]
[]
[]
[]
[]
[]
[]
[]
[]
[]
[]
[]
[]
[]
[]
[]
[]
[]
[]
[]
[null,null,null,"Menu",{"$f":"VLOOKUP(HelpSheet,$D$94:$F$118,2,FALSE)","v":"D14"},{"$f":"VLOOKUP(HelpSheet,$D$94:$F$118,3,FALSE)","v":"K30"},0]
[null,null,null,"Menu","D14","K30"]
[null,null,null,"FarmDesign","D34","M71"]
[null,null,null,"MMSSum","O47","Y71"]
[null,null,null,"Graphic","AX63","BH90"]
[null,null,null,"Report","AY47","BH67"]
[null,null,null,"PigMovements","AJ3","AV41"]
[null,null,null,"Help","H93","L100"]
[null,null,null,"Energy Entry","AX3","BH23"]
[null,null,null,"Genetics","AA47","AI90"]
[null,null,null,"UserAssumotions","O3","AG50"]
[null,null,null,"PigDetails","AJ35","AV90"]
[null,null,null,"FeedRaws","D67","M90"]
[null,null,null,"Feeds","Q71","Y90"]
[null,null,null,"OffSets","AX18","BH43"]

{"sheet":"OffSets","index":2,"n_rows":31,"n_cols":15,"rows_kept":31,"cut":false,"hidden":false,"merged":[[6,4,6,15],[5,5,5,14]]}
[null,null,null,null,null,{"$f":"IF(F8=0,\"*\",\"\")","v":""},{"$f":"IF(G8=0,\"*\",\"\")","v":""},"","*","*","*","*","*","*","*"]
[]
[]
[]
[]
[null,null,null,null,null,"Offset kg CO-e"]
[null,null,null,null,{"$f":"FarmDesign!H9","v":"Harry's Happy Hogs"}]
[null,null,null,"Comment",null,{"$f":"FarmDesign!E14","v":"Breeder"},{"$f":"FarmDesign!E15","v":"Weaner"},{"$f":"FarmDesign!E16","v":"GrowOut"},{"$f":"FarmDesign!E17","v":0},{"$f":"FarmDesign!E18","v":0},{"$f":"FarmDesign!E19","v":0},{"$f":"FarmDesign!E20","v":0},{"$f":"FarmDesign!E21","v":0},{"$f":"FarmDesign!E22","v":0},{"$f":"FarmDesign!E23","v":0}]
[]
[]
[]
[]
[]
[]
[]
[]
[]
[]
[]
[]
[]
[]
[]
[]
[]
[]
[]
[]
[]
[]
[null,null,null,"Total",null,{"$f":"SUM(F9:F30)","v":0},{"$f":"SUM(G9:G30)","v":0},0,0,0,0,0,0,0,0]

{"sheet":"Graphic","index":3,"n_rows":108,"n_cols":75,"rows_kept":108,"cut":false,"hidden":false,"merged":[[67,6,67,21],[23,11,24,15],[21,16,22,19],[27,16,28,19],[23,16,24,19],[4,55,5,63],[8,50,8,51],[9,50,9,51],[10,50,10,51],[12,50,12,51],[14,50,14,51],[7,50,7,51],[19,52,20,61],[9,46,9,47],[9,48,9,49],[10,46,10,47],[10,48,10,49],[7,62,7,63],[7,60,7,61],[7,58,7,59],[9,58,9,59],[9,62,9,63],[10,58,10,59],[11,58,11,59],[43,9,44,15],[35,9,36,10],[37,9,38,10],[9,60,9,61],[10,60,10,61],[11,60,11,61],[10,62,10,63],[11,62,11,63],[22,60,22,61],[22,56,22,57],[22,58,22,59],[21,9,22,15],[39,9,40,10],[26,26,26,27],[26,24,26,25],[41,9,42,10],[29,11,30,15],[31,11,32,15],[33,11,34,15],[35,11,36,15],[37,11,38,15],[39,11,40,15],[27,11,28,15],[25,11,26,15],[52,58,55,62],[23,56,23,57],[26,60,26,61],[43,57,43,62],[44,57,44,58],[44,59,44,60],[44,61,44,62],[47,57,47,58],[47,59,47,60],[47,61,47,62],[23,60,23,61],[24,60,24,61],[24,56,24,57],[24,58,24,59],[46,43,46,48],[44,54,44,55],[45,54,45,55],[43,50,43,55],[47,38,47,39],[47,40,47,41],[47,24,47,25],[35,37,35,38],[47,50,47,51],[47,52,47,53],[44,26,44,27],[47,26,47,27],[47,29,47,30],[47,54,47,55],[47,36,47,37],[47,47,47,48],[44,50,44,51],[44,52,44,53],[47,43,47,44],[47,45,47,46],[45,38,45,39],[45,40,45,41],[44,36,44,37],[45,36,45,37],[33,16,34,19],[31,16,32,19],[29,16,30,19],[26,28,26,29],[27,28,27,29],[60,51,63,62],[45,57,45,58],[45,59,45,60],[45,61,45,62],[60,33,63,46],[46,29,46,34],[46,22,46,27],[46,36,46,41],[45,24,45,25],[44,29,44,30],[44,31,44,32],[44,33,44,34],[45,29,45,30],[45,31,45,32],[45,33,45,34],[44,22,44,23],[44,45,44,46],[52,51,55,54],[27,52,27,55],[28,52,28,55],[25,56,25,57],[24,24,25,29],[14,46,14,47],[14,48,14,49],[19,35,20,42],[23,58,23,59],[28,23,28,29],[27,24,27,25],[27,26,27,27],[51,25,52,27],[52,44,55,47],[47,22,47,23],[45,22,45,23],[47,31,47,32],[47,33,47,34],[3,65,6,65],[27,65,30,65],[37,65,40,65],[33,53,35,59],[18,20,19,33],[20,20,21,33],[35,39,35,40],[29,24,29,25],[27,60,27,61],[28,56,28,57],[28,58,28,59],[28,60,28,61],[23,52,23,55],[24,52,24,55],[25,52,25,55],[26,52,26,55],[14,21,14,23],[10,21,10,23],[44,24,44,25],[12,48,12,49],[22,45,22,48],[21,41,21,44],[10,34,12,36],[10,32,12,33],[10,37,12,38],[22,41,22,44],[11,21,11,23],[14,28,14,29],[14,26,14,27],[12,24,12,25],[12,26,12,27],[14,24,14,25],[10,26,10,27],[12,21,12,23],[11,28,11,29],[11,26,11,27],[11,24,11,25],[12,28,12,29],[13,21,13,23],[10,28,10,29],[45,43,45,44],[45,45,45,46],[34,35,34,36],[34,37,34,38],[29,26,29,27],[12,46,12,47],[44,43,44,44],[21,45,21,48],[43,43,43,48],[36,35,36,36],[36,37,36,38],[36,39,36,40],[23,41,24,44],[23,45,24,48],[22,37,22,40],[23,34,24,36],[23,37,24,40],[43,36,43,41],[44,38,44,39],[44,40,44,41],[34,39,34,40],[35,35,35,36],[4,21,5,29],[4,43,5,53],[4,32,5,40],[7,46,7,47],[7,48,7,49],[8,46,8,47],[8,48,8,49],[8,39,8,40],[9,39,9,40],[9,26,9,27],[6,34,6,36],[8,34,8,36],[7,26,7,27],[8,26,8,27],[8,28,8,29],[7,28,7,29],[9,35,9,36],[9,37,9,38],[8,21,8,23],[7,24,7,25],[9,28,9,29],[2,9,11,19],[12,9,14,19],[46,57,46,62],[25,58,25,59],[25,60,25,61],[26,56,26,57],[26,58,26,59],[9,21,9,23],[6,39,6,40],[7,39,7,40],[45,50,45,51],[45,52,45,53],[46,50,46,55],[44,47,44,48],[10,39,12,40],[8,24,8,25],[9,24,9,25],[10,24,10,25],[45,47,45,48],[12,43,12,45],[19,9,20,19],[6,37,6,38],[7,37,7,38],[8,37,8,38],[45,9,46,19],[29,28,29,29],[34,32,34,34],[31,32,32,39],[33,35,33,36],[33,37,33,38],[33,39,33,40],[21,37,21,40],[33,9,34,10],[31,9,32,10],[29,9,30,10],[25,9,26,10],[25,16,26,19],[43,16,44,19],[45,26,45,27],[43,22,43,27],[43,29,43,34],[23,9,24,10],[27,9,28,10],[41,11,42,15],[41,16,42,19],[39,16,40,19],[37,16,38,19],[35,16,36,19]]}
[null,null,null,null,null,null,null,null,null,null,null,null,null,null,null,null,null,null,null,null,null,null,null,null,null,null,null,null,null,null,null,null,null,null,null,null,null,null,null,null,null,null,null,null,null,null,null,null,null,null,null,null,null,null,null,null,null,null,null,null,null,null,0,null,null,null,null,null,null,0]
[]
[null,null,null,null,null,null,null,null,null,"PigGas"]
[null,null,null,null,null,null,null,null,null,null,null,null,null,null,null,null,null,null,null,null,null,null,null,null,null,null,null,null,null,null,null,null,null,null,null,null,null,null,null,null,null,null,null,null,null,null,null,null,null,null,null,null,null,null,null,null,null,null,null,null,null,null,null,null,null,"On Farm Emissions"]
[null,null,null,null,null,null,null,null,null,null,null,null,null,null,null,null,null,null,null,null,null,"Pre Farm Emissions",null,null,null,null,null,null,null,null,null,null,"Total Emissions",null,null,null,null,null,null,null,null,null,null,"Post Farm Emissions",null,null,null,null,null,null,null,null,null,null,null,"Exported Manure",null,null,null,null,null,null,null,null,null,null,null,null,null,null,"Count =",{"$f":"COUNT(BT9:BT36)","v":20},{"$f":"COUNT(BU9:BU36)","v":20}]
[]
[null,null,null,null,null,null,null,null,null,null,null,null,null,null,null,null,null,null,null,null,null,null,null,null,null,null,null,null,null,null,null,null,null,null,"Baseline",null,null,"Scenario",null,"Dif",null,null,null,null,null,null,null,null,null,null,null,null,null,null,null,null,null,null,null,null,null,null,null,null,null,null,null,null,null,null,"Item","Baseline","Scenario"]
[null,null,null,null,null,null,null,null,null,null,null,null,null,null,null,null,null,null,null,null,null,null,null,null,"Baseline",null,"Scenario",null,"Dif",null,null,null,null,null,null,null,null,null,null,null,null,null,null,null,null,null,"Baseline",null,"Scenario",null,"Dif",null,null,null,null,null,null,null,"Baseline",null,"Scenario",null,"Dif",null,null,null,null,null,null,null,"Prefarm"]
[null,null,null,null,null,null,null,null,null,null,null,null,null,null,null,null,null,null,null,null,null,"Grain",null,null,{"$f":"BT9","v":1320345.8774999999},null,{"$f":"BU9","v":1320345.8774999999},null,{"$f":"AA9-Y9","v":0},null,null,null,"kg CO2-e",null,{"$f":"BT43","v":7274853.5473244833},null,null,{"$f":"BU43","v":7274853.5473244833},null,{"$f":"AL9-AI9","v":0},null,null,null,"Pig Freight",null,null,{"$f":"BT14","v":88493.245961111126},null,{"$f":"BU14","v":88493.245961111126},null,{"$f":"AW9-AU9","v":0},null,null,null,null,null,null,null,null,null,null,null,null,null,null,null,null,null,null,null,"Grain kg CO2-e",1320345.8774999999,{"$f":"AA108","v":1320345.8774999999}]
[null,null,null,null,null,null,null,null,null,null,null,null,null,null,null,null,null,null,null,null,null,"Milling & Delivery",null,null,{"$f":"BT10","v":253506.40847999998},null,{"$f":"BU10","v":253506.40847999998},null,{"$f":"AA10-Y10","v":0},null,null,null,null,null,null,null,null,null,null,null,null,null,null,"Meat Processing",null,null,{"$f":"BT15","v":551563.92000000004},null,{"$f":"BU15","v":551563.92000000004},null,{"$f":"AW10-AU10","v":0},null,null,null,null,"Total",null,null,{"$f":"BT16","v":0},null,{"$f":"BU16","v":0},null,{"$f":"BI10-BG10","v":0},null,null,null,null,null,null,null,"Milling & Delivery kg CO2-e",253506.40847999998,{"$f":"AB108","v":253506.40847999998}]
[null,null,null,null,null,null,null,null,null,null,null,null,null,null,null,null,null,null,null,null,null,"Pig Freight",null,null,{"$f":"BT11","v":0},null,{"$f":"BU11","v":0},null,{"$f":"AA11-Y11","v":0},null,null,null,"kg CO2/\nkg HSCW",null,{"$f":"AI9/$BT$36","v":5.2758008880091234},null,null,{"$f":"AL9/$Q$44","v":5.2758008880091234},null,{"$f":"AI11-AL11","v":0},null,null,null,"Exported Off Farm",null,null,null,null,null,null,null,null,null,null,null,null,null,null,null,null,null,null,null,null,null,null,null,null,null,null,"Pig Freight kg CO2-e",0,{"$f":"AC108","v":0}]
[null,null,null,null,null,null,null,null,null,null,null,null,null,null,null,null,null,null,null,null,null,"Straw & Bedding",null,null,{"$f":"BT12","v":10499.999999999998},null,{"$f":"AE108","v":10499.999999999998},null,{"$f":"AA12-Y12","v":0},null,null,null,null,null,null,null,null,null,null,{"$f":"AJ12-AL12","v":0},null,null,null,null,null,null,null,null,null,null,null,null,null,null,null,{"$f":"AR15","v":"kgCO2/kgHSCW"},null,null,{"$f":"IF($BT$36=0,0,BG10/BT36)","v":0},null,{"$f":"BI10/BU36","v":0},null,{"$f":"BI12-BG12","v":0},null,null,null,null,null,null,null,"Straw & Bedding",10499.999999999998,{"$f":"AE108","v":10499.999999999998}]
[null,null,null,null,null,null,null,null,null,{"$f":"FarmDesign!H11","v":"1000 sow multisite"},null,null,null,null,null,null,null,null,null,null,null,"Total",null,null,{"$f":"SUM(Y9:Z12)","v":1584352.2859799999},null,{"$f":"SUM(AA9:AB12)","v":1584352.2859799999},null,{"$f":"AA13-Y13","v":0},null,null,null,null,null,null,null,null,null,null,0,null,null,null,"Total",null,null,{"$f":"SUM(AU9:AV11)","v":640057.1659611112},null,{"$f":"SUM(AW9:AX11)","v":640057.1659611112},null,{"$f":"AW13-AU13","v":0},null,null,null,null,null,null,null,null,null,null,null,null,null,null,null,null,null,null,null,"Post Farm"]
[null,null,null,null,null,null,null,null,null,null,null,null,null,null,null,null,null,null,null,null,null,null,null,null,null,null,null,null,null,null,null,null,null,null,null,null,null,null,null,null,null,null,null,null,null,null,null,null,null,null,null,null,null,null,null,null,null,null,null,null,null,null,null,null,null,null,null,null,null,null,"Pig Freight",88493.245961111126,{"$f":"AD108","v":88493.245961111126}]
[null,null,null,null,null,null,null,null,null,null,null,null,null,null,null,null,null,null,null,null,null,"kgCO2/kgHSCW",null,null,{"$f":"Y13/$BT$36","v":1.1489890680159063},null,{"$f":"AA13/$Q$44","v":1.1489890680159063},null,{"$f":"Y15-AA15","v":0},null,null,null,null,null,null,null,null,null,null,null,null,null,null,"kgCO2/kgHSCW",null,null,{"$f":"IF($BT$36=0,0,AU13/$BT$36)","v":0.46417623978095679},null,{"$f":"AW13/$Q$44","v":0.46417623978095679},null,{"$f":"AU15-AW15","v":0},null,null,null,null,null,null,null,null,null,null,null,null,null,null,null,null,null,null,null,"Meat Processing",551563.92000000004,{"$f":"AF108","v":551563.92000000004}]
[null,null,null,null,null,null,null,null,null,null,null,null,null,null,null,null,null,null,null,null,null,null,null,null,null,null,null,null,null,null,null,null,null,null,null,null,null,null,null,null,null,null,null,null,null,null,null,null,null,null,null,null,null,null,null,null,null,null,null,null,null,null,null,null,null,null,null,null,null,null,"Exported Manure",0,{"$f":"AK95","v":0}]
[null,null,null,null,null,null,null,null,null,null,null,null,null,null,null,null,null,null,null,null,null,null,null,null,null,null,null,null,null,null,null,null,null,null,null,null,null,null,null,null,null,null,null,null,null,null,null,null,null,null,null,null,null,null,null,null,null,null,null,null,null,null,null,null,null,null,null,null,null,null,"On Farm"]
[]
[null,null,null,null,null,null,null,null,null,null,null,null,null,null,null,null,null,null,null,null,"On Farm Emissions",null,null,null,null,null,null,null,null,null,null,null,null,null,null,null,null,null,null,null,null,null,null,null,null,null,null,null,null,null,null,null,null,null,null,null,null,null,null,null,null,null,null,null,null,null,null,null,null,null,"Purchased Electricity",297527,{"$f":"AH95","v":297527}]
[null,null,null,null,null,null,null,null,null,{"$f":"FarmDesign!H9","v":"Harry's Happy Hogs"},null,null,null,null,null,null,null,null,null,null,null,null,null,null,null,null,null,null,null,null,null,null,null,null,null,"Net Emissions CO2-e",null,null,null,null,null,null,null,null,null,null,null,null,null,null,null,null,"Fuel & Energy",null,null,null,null,null,null,null,null,null,null,null,null,null,null,null,null,null,"Fuel Stationary",67734.92,{"$f":"AI95","v":67734.92}]
[null,null,null,null,null,null,null,null,null,null,null,null,null,null,null,null,null,null,null,null,"Australian Methodology DCCEE",null,null,null,null,null,null,null,null,null,null,null,null,null,null,null,null,null,null,null,null,null,null,null,null,null,null,null,null,null,null,null,null,null,null,null,null,null,null,null,null,null,null,null,null,null,null,null,null,null,"Fuel Transport",8574.2070000000022,{"$f":"AJ95","v":8574.2070000000022}]
[null,null,null,null,null,null,null,null,null,"Select Unit (Double Click)",null,null,null,null,null,null," Net HSCW",null,null,null,null,null,null,null,null,null,null,null,null,null,null,null,null,null,null,null,null,"Baseline",null,null,null,"Scenario",null,null,null,"Dif"]
[null,null,null,null,null,null,null,null,null,null,null,null,null,null,null,null,null,null,null,null,null,null,null,null,null,null,null,null,null,null,null,null,null,null,"kg CO2-e",null,null,{"$f":"BT34","v":5050444.0953833722},null,null,null,{"$f":"BU34","v":5050444.0953833722},null,null,null,{"$f":"AP23-AL23","v":0},null,null,null,null,null,null,null,null,null,null,"Baseline",null,"Scenario",null,"Dif"]
[null,null,null,null,null,null,null,null,null,"ON",null,{"$f":"IF(FarmDesign!E14<>0,FarmDesign!E14,\"\")","v":"Breeder"},null,null,null,null,{"$f":"INDEX($AQ$85:$AQ$95,1)","v":174814.8},null,null,null,null,null,null,null,null,null,null,null,null,null,null,null,null,null,{"$f":"V15","v":"kgCO2/kgHSCW"},null,null,{"$f":"AL23/$BT$36","v":3.6626355802122603},null,null,null,{"$f":"AP23/$Q$44","v":3.6626355802122603},null,null,null,{"$f":"AL24-AP24","v":0},null,null,null,null,null,null,"Purchased Electricity",null,null,null,{"$f":"BT19","v":297527},null,{"$f":"BU19","v":297527},null,{"$f":"BG24-BE24","v":0},null,null,null,null,null,null,null,null,null,"Enteric CH4",185650.29795473121,{"$f":"AA95","v":185650.29795473121}]
[null,null,null,null,null,null,null,null,null,null,null,null,null,null,null,null,null,null,null,null,null,null,null,null,"Offsets",null,null,null,null,null,null,null,null,null,null,null,null,null,null,null,null,null,null,null,null,null,null,null,null,null,null,null,"Fuel Stationary",null,null,null,{"$f":"BT20","v":67734.92},null,{"$f":"BU20","v":67734.92},null,{"$f":"BG25-BE25","v":0},null,null,null,null,null,null,null,null,null,"MMS CH4",3722356.7665025829,{"$f":"AB95","v":3722356.7665025829}]
[null,null,null,null,null,null,null,null,null,"ON",null,{"$f":"IF(FarmDesign!E15<>0,FarmDesign!E15,\"\")","v":"Weaner"},null,null,null,null,{"$f":"INDEX($AQ$85:$AQ$95,2)","v":241669.34999999998},null,null,null,null,null,null,null,null,null,null,null,null,null,null,null,null,null,null,null,null,null,null,null,null,null,null,null,null,null,null,null,null,null,null,null,"Fuel Transport",null,null,null,{"$f":"BT21","v":8574.2070000000022},null,{"$f":"BU21","v":8574.2070000000022},null,{"$f":"BG26-BE26","v":0},null,null,null,null,null,null,null,null,null,"MMS N2O",218430.19635189007,{"$f":"AC95","v":218430.19635189007}]
[null,null,null,null,null,null,null,null,null,null,null,null,null,null,null,null,null,null,null,null,null,null,null,null,"Baseline",null,"Scenario",null,"Dif",null,null,null,null,null,null,null,null,null,null,null,null,null,null,null,null,null,null,null,null,null,null,null,"Total",null,null,null,{"$f":"SUM(BE24:BF26)","v":373836.12699999998},null,{"$f":"SUM(BG24:BH26)","v":373836.12699999998},null,{"$f":"BG27-BE27","v":0},null,null,null,null,null,null,null,null,null,"MMS Vol N2O",210157.64421684245,{"$f":"AD95","v":210157.64421684245}]
[null,null,null,null,null,null,null,null,null,"ON",null,{"$f":"IF(FarmDesign!E16<>0,FarmDesign!E16,\"\")","v":"GrowOut"},null,null,null,null,{"$f":"INDEX($AQ$85:$AQ$95,3)","v":962425.65},null,null,null,null,null,null,null,{"$f":"BT32","v":0},null,{"$f":"BU32","v":0},null,{"$f":"AA28-Y28","v":0},null,null,null,null,null,null,null,null,null,null,null,null,null,null,null,null,null,null,null,null,null,null,null,null,null,null,null,null,null,null,null,null,null,null,null,null,null,null,null,null,null,"Soil LRO N2O",37947.043717280547,{"$f":"AF95","v":37947.043717280547}]
[null,null,null,null,null,null,null,null,null,null,null,null,null,null,null,null,null,null,null,null,null,null,null,{"$f":"V15","v":"kgCO2/kgHSCW"},null,null,null,null,null,null,null,null,null,null,null,null,null,null,null,null,null,null,null,null,null,null,null,null,null,null,null,null,"kgCO2/kgHSCW",null,null,null,{"$f":"IF($BT$36=0,0,BE27/$BT$36)","v":0.27110992104052056},null,{"$f":"BG27/$Q$44","v":0.27110992104052056},null,{"$f":"BG29-BE29","v":0},null,null,null,null,null,null,null,null,null,"Soil Vol N20",302066.01964004419,{"$f":"AG95","v":302066.01964004419}]
[null,null,null,null,null,null,null,null,null,"OFF",null,{"$f":"IF(FarmDesign!E17<>0,FarmDesign!E17,\"\")","v":""},null,null,null,null,{"$f":"INDEX($AQ$85:$AQ$95,4)","v":0},null,null,null,null,null,null,null,{"$f":"IF($BT$36=0,0,Y28/$BT$36)","v":0},null,{"$f":"AA28/$Q$44","v":0},null,{"$f":"Y30-AA30","v":0},null,null,null,null,null,null,null,null,null,null,null,null,null,null,null,null,null,null,null,null,null,null,null,null,null,null,null,null,null,null,null,null,null,null,null,null,null,null,null,null,null,"Emissions",5050444.0953833722,{"$f":"SUM(BU19:BU29)","v":5050444.0953833722}]
[]
[null,null,null,null,null,null,null,null,null,"OFF",null,{"$f":"IF(FarmDesign!E18<>0,FarmDesign!E18,\"\")","v":""},null,null,null,null,{"$f":"INDEX($AQ$85:$AQ$95,5)","v":0},null,null,null,null,null,null,null,null,null,null,null,null,null,null,null," Emissions CO2-e",null,null,null,null,null,null,null,null,null,null,null,null,null,null,null,null,null,null,null,null,null,null,null,null,null,null,null,null,null,null,null,null,null,null,null,null,null,"Offsets",0,{"$f":"AG108","v":0}]
[]
[null,null,null,null,null,null,null,null,null,"OFF",null,{"$f":"IF(FarmDesign!E19<>0,FarmDesign!E19,\"\")","v":""},null,null,null,null,{"$f":"INDEX($AQ$85:$AQ$95,6)","v":0},null,null,null,null,null,null,null,null,null,null,null,null,null,null,null,null,null,null,"Baseline",null,"Scenario",null,"Dif",null,null,null,null,null,null,null,null,null,null,null,null,null,"Combustion Gases",null,null,null,null,null,null,null,null,null,null,null,null,null,null,null,null,"Net Emissions",5050444.0953833722,{"$f":"BU32+BU30","v":5050444.0953833722}]
[null,null,null,null,null,null,null,null,null,null,null,null,null,null,null,null,null,null,null,null,null,null,null,null,null,null,null,null,null,null,null,null,"kg CO2-e",null,null,{"$f":"BT30","v":5050444.0953833722},null,{"$f":"BU30","v":5050444.0953833722},null,{"$f":"AL35-AJ35","v":0}]
[null,null,null,null,null,null,null,null,null,"OFF",null,{"$f":"IF(FarmDesign!E20<>0,FarmDesign!E20,\"\")","v":""},null,null,null,null,{"$f":"INDEX($AQ$85:$AQ$95,7)","v":0},null,null,null,null,null,null,null,null,null,null,null,null,null,null,null,null,null,null,null,null,null,null,null,null,null,null,null,null,null,null,null,null,null,null,null,null,null,null,null,null,null,null,null,null,null,null,null,null,null,null,null,null,null,"HSCW",1378909.8,{"$f":"Q44","v":1378909.8}]
[null,null,null,null,null,null,null,null,null,null,null,null,null,null,null,null,null,null,null,null,null,null,null,null,null,null,null,null,null,null,null,null,{"$f":"AI24","v":"kgCO2/kgHSCW"},null,null,{"$f":"AJ35/$BT$36","v":3.6626355802122603},null,{"$f":"AL35/$Q$44","v":3.6626355802122603},null,{"$f":"AJ37-AL37","v":0}]
[null,null,null,null,null,null,null,null,null,"OFF",null,{"$f":"IF(FarmDesign!E21<>0,FarmDesign!E21,\"\")","v":""},null,null,null,null,{"$f":"INDEX($AQ$85:$AQ$95,8)","v":0},null,null,null,null,null,null,null,null,null,null,null,null,null,null,null,null,null,null,null,null,null,null,null,null,null,null,null,null,null,null,null,null,null,null,null,null,null,null,null,null,null,null,null,null,null,null,null,null,"Total Emissions"]
[null,null,null,null,null,null,null,null,null,null,null,null,null,null,null,null,null,null,null,null,null,null,null,null,null,null,null,null,null,null,null,null,null,null,null,null,null,null,null,null,null,null,null,null,null,null,null,null,null,null,null,null,null,null,null,null,null,null,null,null,null,null,null,null,null,null,null,null,null,null,"Pre Farm",{"$f":"SUM(BT9:BT12)","v":1584352.2859799999},{"$f":"SUM(BU9:BU12)","v":1584352.2859799999}]
[null,null,null,null,null,null,null,null,null,"OFF",null,{"$f":"IF(FarmDesign!E22<>0,FarmDesign!E22,\"\")","v":""},null,null,null,null,{"$f":"INDEX($AQ$85:$AQ$95,9)","v":0},null,null,null,null,null,null,null,null,null,null,null,null,null,null,null,null,null,null,null,null,null,null,null,null,null,null,null,null,null,null,null,null,null,null,null,null,null,null,null,null,null,null,null,null,null,null,null,null,null,null,null,null,null,"On Farm",{"$f":"SUM(BT19:BT29)","v":5050444.0953833722},{"$f":"SUM(BU19:BU29)","v":5050444.0953833722}]
[null,null,null,null,null,null,null,null,null,null,null,null,null,null,null,null,null,null,null,null,null,null,null,null,null,null,null,null,null,null,null,null,null,null,null,null,null,null,null,null,null,null,null,null,null,null,null,null,null,null,null,null,null,null,null,null,null,null,null,null,null,null,null,null,null,null,null,null,null,null,"Post Far",{"$f":"SUM(BT14:BT16)","v":640057.1659611112},{"$f":"SUM(BU14:BU16)","v":640057.1659611112}]
[null,null,null,null,null,null,null,null,null,"OFF",null,{"$f":"IF(FarmDesign!E23<>0,FarmDesign!E23,\"\")","v":""},null,null,null,null,{"$f":"INDEX($AQ$85:$AQ$95,10)","v":0}]
[null,null,null,null,null,null,null,null,null,null,null,null,null,null,null,null,null,null,null,null,null,null,null,null,null,null,null,null,null,null,null,null,null,null,null,null,null,null,null,null,null,null,null,null,null,null,null,null,null,null,null,null,null,null,null,null,null,null,null,null,null,null,null,null,null,null,null,null,null,null,"Total Emissions",{"$f":"SUM(BT39:BT41)","v":7274853.5473244833},{"$f":"SUM(BU39:BU41)","v":7274853.5473244833}]
[null,null,null,null,null,null,null,null,null,"Total",null,null,null,null,null,null,{"$f":"SUM(Q24:R42)","v":1378909.8},null,null,null,null,null,"CH4",null,null,null,null,null,null,"CH4",null,null,null,null,null,null,"N20",null,null,null,null,null,null,"N2O",null,null,null,null,null,null,"N2O",null,null,null,null,null,null,"N2O"]
[null,null,null,null,null,null,null,null,null,null,null,null,null,null,null,null,null,null,null,null,null,null,"Baseline",null,"Scenario",null,"Dif",null,null,"Baseline",null,"Scenario",null,"Dif",null,null,"Baseline",null,"Scenario",null,"Dif",null,null,"Baseline",null,"Scenario",null,"Dif",null,null,"Baseline",null,"Scenario",null,"Dif",null,null,"Baseline",null,"Scenario",null,"Dif",null,null,null,null,null,null,null,null,null,{"$f":"BT7","v":"Baseline"},{"$f":"BU7","v":"Scenario"}]
[null,null,null,null,null,null,null,null,null,{"$f":"NOW()","v":"2014-05-13T15:34:11.030"},null,null,null,null,null,null,null,null,null,null,null,null,{"$f":"BT24","v":185650.29795473121},null,{"$f":"BU24","v":185650.29795473121},null,{"$f":"Y46-W46","v":0},null,null,{"$f":"BT25","v":3722356.7665025829},null,{"$f":"BU25","v":3722356.7665025829},null,{"$f":"AF46-AD46","v":0},null,null,{"$f":"BT26","v":218430.19635189007},null,{"$f":"BU26","v":218430.19635189007},null,{"$f":"AM46-AK46","v":0},null,null,{"$f":"BT27","v":210157.64421684245},null,{"$f":"BU27","v":210157.64421684245},null,{"$f":"AT46-AR46","v":0},null,null,{"$f":"BT28","v":37947.043717280547},null,{"$f":"BU28","v":37947.043717280547},null,{"$f":"BA46-AY46","v":0},null,null,{"$f":"BT29","v":302066.01964004419},null,{"$f":"BU29","v":302066.01964004419},null,{"$f":"BH46-BF46","v":0},null,null,null,null,null,null,null,null,"Pre Farm",{"$f":"BT39/BT$36","v":1.1489890680159063},{"$f":"BU39/BU$36","v":1.1489890680159063}]
[null,null,null,null,null,null,null,null,null,null,null,null,null,null,null,null,null,null,null,null,null,null,{"$f":"V15","v":"kgCO2/kgHSCW"},null,null,null,null,null,null,{"$f":"V15","v":"kgCO2/kgHSCW"},null,null,null,null,null,null,{"$f":"V15","v":"kgCO2/kgHSCW"},null,null,null,null,null,null,{"$f":"V15","v":"kgCO2/kgHSCW"},null,null,null,null,null,null,{"$f":"V15","v":"kgCO2/kgHSCW"},null,null,null,null,null,null,{"$f":"AY47","v":"kgCO2/kgHSCW"},null,null,null,null,null,null,null,null,null,null,null,null,"On Farm",{"$f":"BT40/$BT$36","v":3.6626355802122603},{"$f":"BU40/$BU$36","v":3.6626355802122603}]
[null,null,null,null,null,null,null,null,null,null,null,null,null,null,null,null,null,null,null,null,null,null,{"$f":"IF($BT$36=0,0,W46/$BT$36)","v":0.1346355635116461},null,{"$f":"Y46/$Q$44","v":0.1346355635116461},null,{"$f":"W48-Y48","v":0},null,null,{"$f":"IF($BT$36=0,0,AD46/BT36)","v":2.6994925748606491},null,{"$f":"AF46/$Q$44","v":2.6994925748606491},null,{"$f":"AD48-AF48","v":0},null,null,{"$f":"IF($BT$36=0,0,AK46/$BT$36)","v":0.15840789321527055},null,{"$f":"AM46/$Q$44","v":0.15840789321527055},null,{"$f":"AK48-AM48","v":0},null,null,{"$f":"IF($BT$36=0,0,AR46/$BT$36)","v":0.15240855073830242},null,{"$f":"AT46/$Q$44","v":0.15240855073830242},null,{"$f":"AR48-AT48","v":0},null,null,{"$f":"IF($BT$36=0,0,AY46/BT36)","v":2.7519598248761844E-2},null,{"$f":"BA46/$Q$44","v":2.7519598248761844E-2},null,{"$f":"AY48-BA48","v":0},null,null,{"$f":"IF($BT$36=0,0,BT29/BT36)","v":0.21906147859710923},null,{"$f":"BU29/BU36","v":0.21906147859710923},null,{"$f":"BF48-BH48","v":0},null,null,null,null,null,null,null,null,"Post Farm",{"$f":"BT41/BT$36","v":0.46417623978095679},{"$f":"BU41/BU$36","v":0.46417623978095679}]
[]
[null,null,null,null,null,null,null,null,null,null,null,null,null,null,null,null,null,null,null,null,null,null,null,null,null,null,null,null,null,null,null,null,null,null,null,null,null,null,null,null,null,null,null,null,null,null,null,null,null,null,null,null,null,null,null,null,null,null,null,null,null,null,null,null,null,null,null,null,null,null,"Total Emissions",{"$f":"BT43/BT$36","v":5.2758008880091234},{"$f":"BU43/BU$36","v":5.2758008880091234}]
[]
[null,null,null,null,null,null,null,null,null,null,null,null,null,null,null,null,null,null,null,null,null,null,null,null,null,"Enteric"]
[null,null,null,null,null,null,null,null,null,null,null,null,null,null,null,null,null,null,null,null,null,null,null,null,null,null,null,null,null,null,null,null,null,null,null,null,null,null,null,null,null,null,null,null,"Volatilised NH3 & NOX",null,null,null,null,null,null,"Leaching,  Runoff",null,null,null,null,null,null,"Direct N20"]
[null,null,null,null,null,null,null,null,null,null,null,null,null,null,null,null,null,null,null,null,null,null,null,null,null,null,null,null,null,null,null,null,null,null,null,null,null,null,null,null,null,null,null,null,null,null,null,null,null,null,null,null,null,null,null,null,null,null,null,null,null,null,null,null,null,null,null,null,null,null,null,{"$f":"BT45","v":"Baseline"},{"$f":"BU45","v":"Scenario"},"B - Offset","S - Offset"]
[null,null,null,null,null,null,null,null,null,null,null,null,null,null,null,null,null,null,null,null,null,null,null,null,null,null,null,null,null,null,null,null,null,null,null,null,null,null,null,null,null,null,null,null,null,null,null,null,null,null,null,null,null,null,null,null,null,null,null,null,null,null,null,null,null,null,null,null,null,null,{"$f":"BS24","v":"Enteric CH4"},{"$f":"BT24/BT$36","v":0.1346355635116461},0.1346355635116461]
[null,null,null,null,null,null,null,null,null,null,null,null,null,null,null,null,null,null,null,null,null,null,null,null,null,null,null,null,null,null,null,null,null,null,null,null,null,null,null,null,null,null,null,null,null,null,null,null,null,null,null,null,null,null,null,null,null,null,null,null,null,null,null,null,null,null,null,null,null,null,{"$f":"BS25","v":"MMS CH4"},2.6994925748606491,2.6994925748606491]
[null,null,null,null,null,null,null,null,null,null,null,null,null,null,null,null,null,null,null,null,null,null,null,null,null,null,null,null,null,null,null,null,null,null,null,null,null,null,null,null,null,null,null,null,null,null,null,null,null,null,null,null,null,null,null,null,null,null,null,null,null,null,null,null,null,null,null,null,null,null,{"$f":"BS26","v":"MMS N2O"},0.15840789321527055,0.15840789321527055]
[null,null,null,null,null,null,null,null,null,null,null,null,null,null,null,null,null,null,null,null,null,null,null,null,null,null,null,null,null,null,null,null,null,null,null,null,null,null,null,null,null,null,null,null,null,null,null,null,null,null,null,null,null,null,null,null,null,null,null,null,null,null,null,null,null,null,null,null,null,null,{"$f":"BS27","v":"MMS Vol N2O"},0.15240855073830242,0.15240855073830242]
[null,null,null,null,null,null,null,null,null,null,null,null,null,null,null,null,null,null,null,null,null,null,null,null,null,null,null,null,null,null,null,null,null,null,null,null,null,null,null,null,null,null,null,null,null,null,null,null,null,null,null,null,null,null,null,null,null,null,null,null,null,null,null,null,null,null,null,null,null,null,{"$f":"BS28","v":"Soil LRO N2O"},2.7519598248761844E-2,2.7519598248761844E-2]
[null,null,null,null,null,null,null,null,null,null,null,null,null,null,null,null,null,null,null,null,null,null,null,null,null,null,null,null,null,null,null,null,null,null,null,null,null,null,null,null,null,null,null,null,null,null,null,null,null,null,null,null,null,null,null,null,null,null,null,null,null,null,null,null,null,null,null,null,null,null,"Direct N2O",{"$f":"BF48","v":0.21906147859710923},{"$f":"BH48","v":0.21906147859710923}]
[null,null,null,null,null,null,null,null,null,null,null,null,null,null,null,null,null,null,null,null,null,null,null,null,null,null,null,null,null,null,null,null,null,"Manure Management System",null,null,null,null,null,null,null,null,null,null,null,null,null,null,null,null,null,"Waste Applied to Soil",null,null,null,null,null,null,null,null,null,null,null,null,null,null,null,null,null,null,{"$f":"BS19","v":"Purchased Electricity"},{"$f":"BT19/BT$36","v":0.21576973345174572},0.21576973345174572]
[null,null,null,null,null,null,null,null,null,null,null,null,null,null,null,null,null,null,null,null,null,null,null,null,null,null,null,null,null,null,null,null,null,null,null,null,null,null,null,null,null,null,null,null,null,null,null,null,null,null,null,null,null,null,null,null,null,null,null,null,null,null,null,null,null,null,null,null,null,null,{"$f":"BS20","v":"Fuel Stationary"},4.9122081806946327E-2,4.9122081806946327E-2]
[null,null,null,null,null,null,null,null,null,null,null,null,null,null,null,null,null,null,null,null,null,null,null,null,null,null,null,null,null,null,null,null,null,null,null,null,null,null,null,null,null,null,null,null,null,null,null,null,null,null,null,null,null,null,null,null,null,null,null,null,null,null,null,null,null,null,null,null,null,null,{"$f":"BS21","v":"Fuel Transport"},6.2181057818285158E-3,6.2181057818285158E-3]
[null,null,null,null,null,null,null,null,null,null,null,null,null,null,null,null,null,null,null,null,null,null,null,null,null,null,null,null,null,null,null,null,null,null,null,null,null,null,null,null,null,null,null,null,null,null,null,null,null,null,null,null,null,null,null,null,null,null,null,null,null,null,null,null,null,null,null,null,null,null,"After Offset",null,null,{"$f":"SUM(BT55:BT63)+BT66","v":3.6626355802122599},{"$f":"SUM(BU55:BU63)+BU66","v":3.6626355802122599}]
[]
[null,null,null,null,null,null,null,null,null,null,null,null,null,null,null,null,null,null,null,null,null,null,null,null,null,null,null,null,null,null,null,null,null,null,null,null,null,null,null,null,null,null,null,null,null,null,null,null,null,null,null,null,null,null,null,null,null,null,null,null,null,null,null,null,null,null,null,null,null,null,null,{"$f":"BT32/BT$36","v":0},{"$f":"BU32/BU$36","v":0}]
[]
[null,null,null,null,null,null,{"$f":"TEXT(NOW(),\"d mmmm yyyy\")& \"  -  \"&Menu!$A$1","v":"13 May 2014  -  Pork Industry Greenhouse Gas Calculator     Version 1.02.04"}]
[]
[]
[]
[]
[]
[]
[]
[]
[]
[]
[]
[]
[]
[]
[]
[null,null,null,null,null,null,null,null,null,null,null,null,null,null,null,null,null,null,null,null,null,null,"On Farm",null,null,null,"Enteric CH4","MMS-CH4","MMS- Direct N2O","MMS - Volatilisation N2O",null,"Soil - Leach & Runoff N2O","Soil N2O","PPE","PFS","PFT","Export",null,null,"FPE","FFT","FFT","DWT"]
[null,null,null,null,null,null,null,null,null,null,null,null,null,null,null,null,null,null,null,null,null,null,null,{"$f":"IF(J24=\"ON\",1,0)","v":1},1,{"$f":"L24","v":"Breeder"},{"$f":"INDEX(Report!$G$60:$P$60,Graphic!Y85)*X85","v":42629.107651599043},{"$f":"INDEX(Report!$G$61:$P$61,Graphic!Y85)*X85","v":922948.0843897257},{"$f":"INDEX(Report!$G$62:$P$62,Graphic!Y85)*X85","v":23456.199091395629},{"$f":"INDEX(Report!$G$63:$P$63,Graphic!Y85)*X85","v":48416.000688649932},null,{"$f":"INDEX(Report!$G$64:$P$64,Graphic!Y85)*X85","v":8999.478247259658},{"$f":"INDEX(Report!$G$65:$P$65,Graphic!Y85)*X85","v":71637.637789131608},{"$f":"INDEX(Report!$G$53:$P$53,Graphic!Y85)*X85","v":280350},{"$f":"INDEX(Report!$G$54:$P$54,Graphic!Y85)*X85","v":54649.764999999999},{"$f":"INDEX(Report!$G$55:$P$55,Graphic!Y85)*X85","v":5237.3700000000008},{"$f":"INDEX(Report!$G$78:$P$78,Graphic!Y85)*X85","v":0},null,null,{"$f":"INDEX(Report!#REF!,Graphic!Y85)*X85","v":{"$error":"#REF!"}},{"$f":"INDEX(Report!#REF!,Graphic!Y85)*X85","v":{"$error":"#REF!"}},{"$f":"INDEX(Report!#REF!,Graphic!Y85)*X85","v":{"$error":"#REF!"}},{"$f":"INDEX(Report!$G$31:$P$31,Graphic!Y85)*X85","v":174814.8}]
[null,null,null,null,null,null,null,null,null,null,null,null,null,null,null,null,null,null,null,null,null,null,null,{"$f":"IF(J26=\"ON\",1,0)","v":1},2,{"$f":"L26","v":"Weaner"},{"$f":"INDEX(Report!$G$60:$P$60,Graphic!Y86)*X86","v":26523.167154791376},{"$f":"INDEX(Report!$G$61:$P$61,Graphic!Y86)*X86","v":11399.10672585998},{"$f":"INDEX(Report!$G$62:$P$62,Graphic!Y86)*X86","v":130881.59891070468},{"$f":"INDEX(Report!$G$63:$P$63,Graphic!Y86)*X86","v":29448.35975490855},null,{"$f":"INDEX(Report!$G$64:$P$64,Graphic!Y86)*X86","v":4357.130228736678},{"$f":"INDEX(Report!$G$65:$P$65,Graphic!Y86)*X86","v":34683.623711336732},{"$f":"INDEX(Report!$G$53:$P$53,Graphic!Y86)*X86","v":4272},{"$f":"INDEX(Report!$G$54:$P$54,Graphic!Y86)*X86","v":13085.155000000001},{"$f":"INDEX(Report!$G$55:$P$55,Graphic!Y86)*X86","v":2364.7620000000002},{"$f":"INDEX(Report!$G$78:$P$78,Graphic!Y86)*X86","v":0},null,null,{"$f":"INDEX(Report!#REF!,Graphic!Y86)*X86","v":{"$error":"#REF!"}},{"$f":"INDEX(Report!#REF!,Graphic!Y86)*X86","v":{"$error":"#REF!"}},{"$f":"INDEX(Report!#REF!,Graphic!Y86)*X86","v":{"$error":"#REF!"}},{"$f":"INDEX(Report!$G$31:$P$31,Graphic!Y86)*X86","v":241669.34999999998}]
[null,null,null,null,null,null,null,null,null,null,null,null,null,null,null,null,null,null,null,null,null,null,null,{"$f":"IF(J28=\"ON\",1,0)","v":1},3,{"$f":"L28","v":"GrowOut"},{"$f":"INDEX(Report!$G$60:$P$60,Graphic!Y87)*X87","v":116498.02314834081},{"$f":"INDEX(Report!$G$61:$P$61,Graphic!Y87)*X87","v":2788009.5753869973},{"$f":"INDEX(Report!$G$62:$P$62,Graphic!Y87)*X87","v":64092.398349789757},{"$f":"INDEX(Report!$G$63:$P$63,Graphic!Y87)*X87","v":132293.28377328397},null,{"$f":"INDEX(Report!$G$64:$P$64,Graphic!Y87)*X87","v":24590.435241284209},{"$f":"INDEX(Report!$G$65:$P$65,Graphic!Y87)*X87","v":195744.75813957583},{"$f":"INDEX(Report!$G$53:$P$53,Graphic!Y87)*X87","v":12905},{"$f":"INDEX(Report!$G$54:$P$54,Graphic!Y87)*X87","v":0},{"$f":"INDEX(Report!$G$55:$P$55,Graphic!Y87)*X87","v":972.07500000000005},{"$f":"INDEX(Report!$G$78:$P$78,Graphic!Y87)*X87","v":0},null,null,{"$f":"INDEX(Report!#REF!,Graphic!Y87)*X87","v":{"$error":"#REF!"}},{"$f":"INDEX(Report!#REF!,Graphic!Y87)*X87","v":{"$error":"#REF!"}},{"$f":"INDEX(Report!#REF!,Graphic!Y87)*X87","v":{"$error":"#REF!"}},{"$f":"INDEX(Report!$G$31:$P$31,Graphic!Y87)*X87","v":962425.65}]
[null,null,null,null,null,null,null,null,null,null,null,null,null,null,null,null,null,null,null,null,null,null,null,{"$f":"IF(J30=\"ON\",1,0)","v":0},4,{"$f":"L30","v":""},{"$f":"INDEX(Report!$G$60:$P$60,Graphic!Y88)*X88","v":0},{"$f":"INDEX(Report!$G$61:$P$61,Graphic!Y88)*X88","v":0},{"$f":"INDEX(Report!$G$62:$P$62,Graphic!Y88)*X88","v":0},{"$f":"INDEX(Report!$G$63:$P$63,Graphic!Y88)*X88","v":0},null,{"$f":"INDEX(Report!$G$64:$P$64,Graphic!Y88)*X88","v":0},{"$f":"INDEX(Report!$G$65:$P$65,Graphic!Y88)*X88","v":0},{"$f":"INDEX(Report!$G$53:$P$53,Graphic!Y88)*X88","v":0},{"$f":"INDEX(Report!$G$54:$P$54,Graphic!Y88)*X88","v":0},{"$f":"INDEX(Report!$G$55:$P$55,Graphic!Y88)*X88","v":0},{"$f":"INDEX(Report!$G$78:$P$78,Graphic!Y88)*X88","v":0},null,null,{"$f":"INDEX(Report!#REF!,Graphic!Y88)*X88","v":{"$error":"#REF!"}},{"$f":"INDEX(Report!#REF!,Graphic!Y88)*X88","v":{"$error":"#REF!"}},{"$f":"INDEX(Report!#REF!,Graphic!Y88)*X88","v":{"$error":"#REF!"}},{"$f":"INDEX(Report!$G$31:$P$31,Graphic!Y88)*X88","v":0}]
[null,null,null,null,null,null,null,null,null,null,null,null,null,null,null,null,null,null,null,null,null,null,null,{"$f":"IF(J32=\"ON\",1,0)","v":0},5,{"$f":"L32","v":""},{"$f":"INDEX(Report!$G$60:$P$60,Graphic!Y89)*X89","v":0},{"$f":"INDEX(Report!$G$61:$P$61,Graphic!Y89)*X89","v":0},{"$f":"INDEX(Report!$G$62:$P$62,Graphic!Y89)*X89","v":0},{"$f":"INDEX(Report!$G$63:$P$63,Graphic!Y89)*X89","v":0},null,{"$f":"INDEX(Report!$G$64:$P$64,Graphic!Y89)*X89","v":0},{"$f":"INDEX(Report!$G$65:$P$65,Graphic!Y89)*X89","v":0},{"$f":"INDEX(Report!$G$53:$P$53,Graphic!Y89)*X89","v":0},{"$f":"INDEX(Report!$G$54:$P$54,Graphic!Y89)*X89","v":0},{"$f":"INDEX(Report!$G$55:$P$55,Graphic!Y89)*X89","v":0},{"$f":"INDEX(Report!$G$78:$P$78,Graphic!Y89)*X89","v":0},null,null,{"$f":"INDEX(Report!#REF!,Graphic!Y89)*X89","v":{"$error":"#REF!"}},{"$f":"INDEX(Report!#REF!,Graphic!Y89)*X89","v":{"$error":"#REF!"}},{"$f":"INDEX(Report!#REF!,Graphic!Y89)*X89","v":{"$error":"#REF!"}},{"$f":"INDEX(Report!$G$31:$P$31,Graphic!Y89)*X89","v":0}]
[null,null,null,null,null,null,null,null,null,null,null,null,null,null,null,null,null,null,null,null,null,null,null,{"$f":"IF(J34=\"ON\",1,0)","v":0},6,{"$f":"L34","v":""},{"$f":"INDEX(Report!$G$60:$P$60,Graphic!Y90)*X90","v":0},{"$f":"INDEX(Report!$G$61:$P$61,Graphic!Y90)*X90","v":0},{"$f":"INDEX(Report!$G$62:$P$62,Graphic!Y90)*X90","v":0},{"$f":"INDEX(Report!$G$63:$P$63,Graphic!Y90)*X90","v":0},null,{"$f":"INDEX(Report!$G$64:$P$64,Graphic!Y90)*X90","v":0},{"$f":"INDEX(Report!$G$65:$P$65,Graphic!Y90)*X90","v":0},{"$f":"INDEX(Report!$G$53:$P$53,Graphic!Y90)*X90","v":0},{"$f":"INDEX(Report!$G$54:$P$54,Graphic!Y90)*X90","v":0},{"$f":"INDEX(Report!$G$55:$P$55,Graphic!Y90)*X90","v":0},{"$f":"INDEX(Report!$G$78:$P$78,Graphic!Y90)*X90","v":0},null,null,{"$f":"INDEX(Report!#REF!,Graphic!Y90)*X90","v":{"$error":"#REF!"}},{"$f":"INDEX(Report!#REF!,Graphic!Y90)*X90","v":{"$error":"#REF!"}},{"$f":"INDEX(Report!#REF!,Graphic!Y90)*X90","v":{"$error":"#REF!"}},{"$f":"INDEX(Report!$G$31:$P$31,Graphic!Y90)*X90","v":0}]
[null,null,null,null,null,null,null,null,null,null,null,null,null,null,null,null,null,null,null,null,null,null,null,{"$f":"IF(J36=\"ON\",1,0)","v":0},7,{"$f":"L36","v":""},{"$f":"INDEX(Report!$G$60:$P$60,Graphic!Y91)*X91","v":0},{"$f":"INDEX(Report!$G$61:$P$61,Graphic!Y91)*X91","v":0},{"$f":"INDEX(Report!$G$62:$P$62,Graphic!Y91)*X91","v":0},{"$f":"INDEX(Report!$G$63:$P$63,Graphic!Y91)*X91","v":0},null,{"$f":"INDEX(Report!$G$64:$P$64,Graphic!Y91)*X91","v":0},{"$f":"INDEX(Report!$G$65:$P$65,Graphic!Y91)*X91","v":0},{"$f":"INDEX(Report!$G$53:$P$53,Graphic!Y91)*X91","v":0},{"$f":"INDEX(Report!$G$54:$P$54,Graphic!Y91)*X91","v":0},{"$f":"INDEX(Report!$G$55:$P$55,Graphic!Y91)*X91","v":0},{"$f":"INDEX(Report!$G$78:$P$78,Graphic!Y91)*X91","v":0},null,null,{"$f":"INDEX(Report!#REF!,Graphic!Y91)*X91","v":{"$error":"#REF!"}},{"$f":"INDEX(Report!#REF!,Graphic!Y91)*X91","v":{"$error":"#REF!"}},{"$f":"INDEX(Report!#REF!,Graphic!Y91)*X91","v":{"$error":"#REF!"}},{"$f":"INDEX(Report!$G$31:$P$31,Graphic!Y91)*X91","v":0}]
[null,null,null,null,null,null,null,null,null,null,null,null,null,null,null,null,null,null,null,null,null,null,null,{"$f":"IF(J38=\"ON\",1,0)","v":0},8,{"$f":"L38","v":""},{"$f":"INDEX(Report!$G$60:$P$60,Graphic!Y92)*X92","v":0},{"$f":"INDEX(Report!$G$61:$P$61,Graphic!Y92)*X92","v":0},{"$f":"INDEX(Report!$G$62:$P$62,Graphic!Y92)*X92","v":0},{"$f":"INDEX(Report!$G$63:$P$63,Graphic!Y92)*X92","v":0},null,{"$f":"INDEX(Report!$G$64:$P$64,Graphic!Y92)*X92","v":0},{"$f":"INDEX(Report!$G$65:$P$65,Graphic!Y92)*X92","v":0},{"$f":"INDEX(Report!$G$53:$P$53,Graphic!Y92)*X92","v":0},{"$f":"INDEX(Report!$G$54:$P$54,Graphic!Y92)*X92","v":0},{"$f":"INDEX(Report!$G$55:$P$55,Graphic!Y92)*X92","v":0},{"$f":"INDEX(Report!$G$78:$P$78,Graphic!Y92)*X92","v":0},null,null,{"$f":"INDEX(Report!#REF!,Graphic!Y92)*X92","v":{"$error":"#REF!"}},{"$f":"INDEX(Report!#REF!,Graphic!Y92)*X92","v":{"$error":"#REF!"}},{"$f":"INDEX(Report!#REF!,Graphic!Y92)*X92","v":{"$error":"#REF!"}},{"$f":"INDEX(Report!$G$31:$P$31,Graphic!Y92)*X92","v":0}]
[null,null,null,null,null,null,null,null,null,null,null,null,null,null,null,null,null,null,null,null,null,null,null,{"$f":"IF(J40=\"ON\",1,0)","v":0},9,{"$f":"L40","v":""},{"$f":"INDEX(Report!$G$60:$P$60,Graphic!Y93)*X93","v":0},{"$f":"INDEX(Report!$G$61:$P$61,Graphic!Y93)*X93","v":0},{"$f":"INDEX(Report!$G$62:$P$62,Graphic!Y93)*X93","v":0},{"$f":"INDEX(Report!$G$63:$P$63,Graphic!Y93)*X93","v":0},null,{"$f":"INDEX(Report!$G$64:$P$64,Graphic!Y93)*X93","v":0},{"$f":"INDEX(Report!$G$65:$P$65,Graphic!Y93)*X93","v":0},{"$f":"INDEX(Report!$G$53:$P$53,Graphic!Y93)*X93","v":0},{"$f":"INDEX(Report!$G$54:$P$54,Graphic!Y93)*X93","v":0},{"$f":"INDEX(Report!$G$55:$P$55,Graphic!Y93)*X93","v":0},{"$f":"INDEX(Report!$G$78:$P$78,Graphic!Y93)*X93","v":0},null,null,{"$f":"INDEX(Report!#REF!,Graphic!Y93)*X93","v":{"$error":"#REF!"}},{"$f":"INDEX(Report!#REF!,Graphic!Y93)*X93","v":{"$error":"#REF!"}},{"$f":"INDEX(Report!#REF!,Graphic!Y93)*X93","v":{"$error":"#REF!"}},{"$f":"INDEX(Report!$G$31:$P$31,Graphic!Y93)*X93","v":0}]
[null,null,null,null,null,null,null,null,null,null,null,null,null,null,null,null,null,null,null,null,null,null,null,{"$f":"IF(J42=\"ON\",1,0)","v":0},10,{"$f":"L42","v":""},{"$f":"INDEX(Report!$G$60:$P$60,Graphic!Y94)*X94","v":0},{"$f":"INDEX(Report!$G$61:$P$61,Graphic!Y94)*X94","v":0},{"$f":"INDEX(Report!$G$62:$P$62,Graphic!Y94)*X94","v":0},{"$f":"INDEX(Report!$G$63:$P$63,Graphic!Y94)*X94","v":0},null,{"$f":"INDEX(Report!$G$64:$P$64,Graphic!Y94)*X94","v":0},{"$f":"INDEX(Report!$G$65:$P$65,Graphic!Y94)*X94","v":0},{"$f":"INDEX(Report!$G$53:$P$53,Graphic!Y94)*X94","v":0},{"$f":"INDEX(Report!$G$54:$P$54,Graphic!Y94)*X94","v":0},{"$f":"INDEX(Report!$G$55:$P$55,Graphic!Y94)*X94","v":0},{"$f":"INDEX(Report!$G$78:$P$78,Graphic!Y94)*X94","v":0},null,null,{"$f":"INDEX(Report!#REF!,Graphic!Y94)*X94","v":{"$error":"#REF!"}},{"$f":"INDEX(Report!#REF!,Graphic!Y94)*X94","v":{"$error":"#REF!"}},{"$f":"INDEX(Report!#REF!,Graphic!Y94)*X94","v":{"$error":"#REF!"}},{"$f":"INDEX(Report!$G$31:$P$31,Graphic!Y94)*X94","v":0}]
[null,null,null,null,null,null,null,null,null,null,null,null,null,null,null,null,null,null,null,null,null,null,null,null,null,"Total",{"$f":"SUM(AA85:AA94)","v":185650.29795473121},{"$f":"SUM(AB85:AB94)","v":3722356.7665025829},{"$f":"SUM(AC85:AC94)","v":218430.19635189007},{"$f":"SUM(AD85:AD94)","v":210157.64421684245},null,{"$f":"SUM(AF85:AF94)","v":37947.043717280547},302066.01964004419,297527,67734.92,8574.2070000000022,0,null,null,{"$f":"SUM(AN85:AN94)","v":{"$error":"#REF!"}},{"$f":"SUM(AO85:AO94)","v":{"$error":"#REF!"}},{"$f":"SUM(AP85:AP94)","v":{"$error":"#REF!"}},{"$f":"SUM(AQ85:AQ94)","v":1378909.8}]
[]
[null,null,null,null,null,null,null,null,null,null,null,null,null,null,null,null,null,null,null,null,null,null,"Pre/Post Farm & offset",null,null,null,"Grain","Mill","Frt In","Frt out","Straw","Kill","Offset"]
[null,null,null,null,null,null,null,null,null,null,null,null,null,null,null,null,null,null,null,null,null,null,null,{"$f":"X85","v":1},1,"Breeder",{"$f":"INDEX(Report!$G$43:$P$43,Graphic!Y85)*X85","v":294139.47749999998},{"$f":"INDEX(Report!$G$44:$P$44,Graphic!Y85)*X85","v":56474.779679999992},{"$f":"INDEX(Report!$G$45:$P$45,Graphic!Y85)*X85","v":0},{"$f":"INDEX(Report!$G$76:$P$76,Graphic!Y85)*X85","v":1556.9267111111114},{"$f":"INDEX(Report!$G$46:$P$46,Graphic!Y85)*X85","v":0},{"$f":"INDEX(Report!$G$77:$P$77,Graphic!Y85)*X85","v":22626.720000000001},{"$f":"INDEX(Report!$G$70:$P$70,Graphic!Y85)*X85","v":0}]
[null,null,null,null,null,null,null,null,null,null,null,null,null,null,null,null,null,null,null,null,null,null,null,1,2,"Weaner",{"$f":"INDEX(Report!$G$43:$P$43,Graphic!Y86)*X86","v":184414.72500000001},{"$f":"INDEX(Report!$G$44:$P$44,Graphic!Y86)*X86","v":35407.627200000003},{"$f":"INDEX(Report!$G$45:$P$45,Graphic!Y86)*X86","v":0},{"$f":"INDEX(Report!$G$76:$P$76,Graphic!Y86)*X86","v":0},{"$f":"INDEX(Report!$G$46:$P$46,Graphic!Y86)*X86","v":10499.999999999998},{"$f":"INDEX(Report!$G$77:$P$77,Graphic!Y86)*X86","v":0},{"$f":"INDEX(Report!$G$70:$P$70,Graphic!Y86)*X86","v":0}]
[null,null,null,null,null,null,null,null,null,null,null,null,null,null,null,null,null,null,null,null,null,null,null,1,3,"GrowOut",{"$f":"INDEX(Report!$G$43:$P$43,Graphic!Y87)*X87","v":841791.67499999993},{"$f":"INDEX(Report!$G$44:$P$44,Graphic!Y87)*X87","v":161624.00159999999},{"$f":"INDEX(Report!$G$45:$P$45,Graphic!Y87)*X87","v":0},{"$f":"INDEX(Report!$G$76:$P$76,Graphic!Y87)*X87","v":86936.319250000015},{"$f":"INDEX(Report!$G$46:$P$46,Graphic!Y87)*X87","v":0},{"$f":"INDEX(Report!$G$77:$P$77,Graphic!Y87)*X87","v":528937.20000000007},{"$f":"INDEX(Report!$G$70:$P$70,Graphic!Y87)*X87","v":0}]
[null,null,null,null,null,null,null,null,null,null,null,null,null,null,null,null,null,null,null,null,null,null,null,0,4,"",{"$f":"INDEX(Report!$G$43:$P$43,Graphic!Y88)*X88","v":0},{"$f":"INDEX(Report!$G$44:$P$44,Graphic!Y88)*X88","v":0},{"$f":"INDEX(Report!$G$45:$P$45,Graphic!Y88)*X88","v":0},{"$f":"INDEX(Report!$G$76:$P$76,Graphic!Y88)*X88","v":0},{"$f":"INDEX(Report!$G$46:$P$46,Graphic!Y88)*X88","v":0},{"$f":"INDEX(Report!$G$77:$P$77,Graphic!Y88)*X88","v":0},{"$f":"INDEX(Report!$G$70:$P$70,Graphic!Y88)*X88","v":0}]
[null,null,null,null,null,null,null,null,null,null,null,null,null,null,null,null,null,null,null,null,null,null,null,0,5,"",{"$f":"INDEX(Report!$G$43:$P$43,Graphic!Y89)*X89","v":0},{"$f":"INDEX(Report!$G$44:$P$44,Graphic!Y89)*X89","v":0},{"$f":"INDEX(Report!$G$45:$P$45,Graphic!Y89)*X89","v":0},{"$f":"INDEX(Report!$G$76:$P$76,Graphic!Y89)*X89","v":0},{"$f":"INDEX(Report!$G$46:$P$46,Graphic!Y89)*X89","v":0},{"$f":"INDEX(Report!$G$77:$P$77,Graphic!Y89)*X89","v":0},{"$f":"INDEX(Report!$G$70:$P$70,Graphic!Y89)*X89","v":0}]
[null,null,null,null,null,null,null,null,null,null,null,null,null,null,null,null,null,null,null,null,null,null,null,0,6,"",{"$f":"INDEX(Report!$G$43:$P$43,Graphic!Y90)*X90","v":0},{"$f":"INDEX(Report!$G$44:$P$44,Graphic!Y90)*X90","v":0},{"$f":"INDEX(Report!$G$45:$P$45,Graphic!Y90)*X90","v":0},{"$f":"INDEX(Report!$G$76:$P$76,Graphic!Y90)*X90","v":0},{"$f":"INDEX(Report!$G$46:$P$46,Graphic!Y90)*X90","v":0},{"$f":"INDEX(Report!$G$77:$P$77,Graphic!Y90)*X90","v":0},{"$f":"INDEX(Report!$G$70:$P$70,Graphic!Y90)*X90","v":0}]
[null,null,null,null,null,null,null,null,null,null,null,null,null,null,null,null,null,null,null,null,null,null,null,0,7,"",{"$f":"INDEX(Report!$G$43:$P$43,Graphic!Y91)*X91","v":0},{"$f":"INDEX(Report!$G$44:$P$44,Graphic!Y91)*X91","v":0},{"$f":"INDEX(Report!$G$45:$P$45,Graphic!Y91)*X91","v":0},{"$f":"INDEX(Report!$G$76:$P$76,Graphic!Y91)*X91","v":0},{"$f":"INDEX(Report!$G$46:$P$46,Graphic!Y91)*X91","v":0},{"$f":"INDEX(Report!$G$77:$P$77,Graphic!Y91)*X91","v":0},{"$f":"INDEX(Report!$G$70:$P$70,Graphic!Y91)*X91","v":0}]
[null,null,null,null,null,null,null,null,null,null,null,null,null,null,null,null,null,null,null,null,null,null,null,0,8,"",{"$f":"INDEX(Report!$G$43:$P$43,Graphic!Y92)*X92","v":0},{"$f":"INDEX(Report!$G$44:$P$44,Graphic!Y92)*X92","v":0},{"$f":"INDEX(Report!$G$45:$P$45,Graphic!Y92)*X92","v":0},{"$f":"INDEX(Report!$G$76:$P$76,Graphic!Y92)*X92","v":0},{"$f":"INDEX(Report!$G$46:$P$46,Graphic!Y92)*X92","v":0},{"$f":"INDEX(Report!$G$77:$P$77,Graphic!Y92)*X92","v":0},{"$f":"INDEX(Report!$G$70:$P$70,Graphic!Y92)*X92","v":0}]
[null,null,null,null,null,null,null,null,null,null,null,null,null,null,null,null,null,null,null,null,null,null,null,0,9,"",{"$f":"INDEX(Report!$G$43:$P$43,Graphic!Y93)*X93","v":0},{"$f":"INDEX(Report!$G$44:$P$44,Graphic!Y93)*X93","v":0},{"$f":"INDEX(Report!$G$45:$P$45,Graphic!Y93)*X93","v":0},{"$f":"INDEX(Report!$G$76:$P$76,Graphic!Y93)*X93","v":0},{"$f":"INDEX(Report!$G$46:$P$46,Graphic!Y93)*X93","v":0},{"$f":"INDEX(Report!$G$77:$P$77,Graphic!Y93)*X93","v":0},{"$f":"INDEX(Report!$G$70:$P$70,Graphic!Y93)*X93","v":0}]
[null,null,null,null,null,null,null,null,null,null,null,null,null,null,null,null,null,null,null,null,null,null,null,0,10,"",{"$f":"INDEX(Report!$G$43:$P$43,Graphic!Y94)*X94","v":0},{"$f":"INDEX(Report!$G$44:$P$44,Graphic!Y94)*X94","v":0},{"$f":"INDEX(Report!$G$45:$P$45,Graphic!Y94)*X94","v":0},{"$f":"INDEX(Report!$G$76:$P$76,Graphic!Y94)*X94","v":0},{"$f":"INDEX(Report!$G$46:$P$46,Graphic!Y94)*X94","v":0},{"$f":"INDEX(Report!$G$77:$P$77,Graphic!Y94)*X94","v":0},{"$f":"INDEX(Report!$G$70:$P$70,Graphic!Y94)*X94","v":0}]
[null,null,null,null,null,null,null,null,null,null,null,null,null,null,null,null,null,null,null,null,null,null,null,null,null,"Total",{"$f":"SUM(AA98:AA107)","v":1320345.8774999999},{"$f":"SUM(AB98:AB107)","v":253506.40847999998},0,88493.245961111126,10499.999999999998,551563.92000000004,0,null,null,0,0,null,0,0,0,0]

{"sheet":"PigNo","index":4,"n_rows":19,"n_cols":16,"rows_kept":19,"cut":false,"hidden":false,"merged":[[5,5,5,15],[3,4,3,15]]}
[]
[]
[]
[null,null,null,null,{"$f":"\"Livestock Numbers  -  \"&FarmDesign!H9","v":"Livestock Numbers  -  Harry's Happy Hogs"}]
[]
[null,null,null,null,null,"Unit"]
[null,null,null,null,null,1,2,3,4,5,6,7,8,9,10]
[null,null,null,null,"Category",{"$f":"INDEX(FarmDesign!$E$14:$E$23,PigNo!F7)","v":"Breeder"},{"$f":"INDEX(FarmDesign!$E$14:$E$23,PigNo!G7)","v":"Weaner"},{"$f":"INDEX(FarmDesign!$E$14:$E$23,PigNo!H7)","v":"GrowOut"},{"$f":"INDEX(FarmDesign!$E$14:$E$23,PigNo!I7)","v":0},{"$f":"INDEX(FarmDesign!$E$14:$E$23,PigNo!J7)","v":0},{"$f":"INDEX(FarmDesign!$E$14:$E$23,PigNo!K7)","v":0},{"$f":"INDEX(FarmDesign!$E$14:$E$23,PigNo!L7)","v":0},{"$f":"INDEX(FarmDesign!$E$14:$E$23,PigNo!M7)","v":0},{"$f":"INDEX(FarmDesign!$E$14:$E$23,PigNo!N7)","v":0},{"$f":"INDEX(FarmDesign!$E$14:$E$23,PigNo!O7)","v":0},"Total"]
[null,null,null,1,{"$f":"INDEX(PigCats,PigNo!D9)","v":"Gilts"},{"$f":"SUMIF(PigDetails!$H$18:$BE$18,PigNo!F$8&PigNo!$E9,PigDetails!$H$19:$BE$19)","v":50},{"$f":"SUMIF(PigDetails!$H$18:$BE$18,PigNo!G$8&PigNo!$E9,PigDetails!$H$19:$BE$19)","v":0},{"$f":"SUMIF(PigDetails!$H$18:$BE$18,PigNo!H$8&PigNo!$E9,PigDetails!$H$19:$BE$19)","v":0},{"$f":"SUMIF(PigDetails!$H$18:$BE$18,PigNo!I$8&PigNo!$E9,PigDetails!$H$19:$BE$19)","v":0},{"$f":"SUMIF(PigDetails!$H$18:$BE$18,PigNo!J$8&PigNo!$E9,PigDetails!$H$19:$BE$19)","v":0},{"$f":"SUMIF(PigDetails!$H$18:$BE$18,PigNo!K$8&PigNo!$E9,PigDetails!$H$19:$BE$19)","v":0},{"$f":"SUMIF(PigDetails!$H$18:$BE$18,PigNo!L$8&PigNo!$E9,PigDetails!$H$19:$BE$19)","v":0},{"$f":"SUMIF(PigDetails!$H$18:$BE$18,PigNo!M$8&PigNo!$E9,PigDetails!$H$19:$BE$19)","v":0},{"$f":"SUMIF(PigDetails!$H$18:$BE$18,PigNo!N$8&PigNo!$E9,PigDetails!$H$19:$BE$19)","v":0},{"$f":"SUMIF(PigDetails!$H$18:$BE$18,PigNo!O$8&PigNo!$E9,PigDetails!$H$19:$BE$19)","v":0},{"$f":"SUM(F9:O9)","v":50}]
[null,null,null,2,{"$f":"INDEX(PigCats,PigNo!D10)","v":"Boars"},{"$f":"SUMIF(PigDetails!$H$18:$BE$18,PigNo!F$8&PigNo!$E10,PigDetails!$H$19:$BE$19)","v":42},{"$f":"SUMIF(PigDetails!$H$18:$BE$18,PigNo!G$8&PigNo!$E10,PigDetails!$H$19:$BE$19)","v":0},{"$f":"SUMIF(PigDetails!$H$18:$BE$18,PigNo!H$8&PigNo!$E10,PigDetails!$H$19:$BE$19)","v":0},{"$f":"SUMIF(PigDetails!$H$18:$BE$18,PigNo!I$8&PigNo!$E10,PigDetails!$H$19:$BE$19)","v":0},{"$f":"SUMIF(PigDetails!$H$18:$BE$18,PigNo!J$8&PigNo!$E10,PigDetails!$H$19:$BE$19)","v":0},{"$f":"SUMIF(PigDetails!$H$18:$BE$18,PigNo!K$8&PigNo!$E10,PigDetails!$H$19:$BE$19)","v":0},{"$f":"SUMIF(PigDetails!$H$18:$BE$18,PigNo!L$8&PigNo!$E10,PigDetails!$H$19:$BE$19)","v":0},{"$f":"SUMIF(PigDetails!$H$18:$BE$18,PigNo!M$8&PigNo!$E10,PigDetails!$H$19:$BE$19)","v":0},{"$f":"SUMIF(PigDetails!$H$18:$BE$18,PigNo!N$8&PigNo!$E10,PigDetails!$H$19:$BE$19)","v":0},{"$f":"SUMIF(PigDetails!$H$18:$BE$18,PigNo!O$8&PigNo!$E10,PigDetails!$H$19:$BE$19)","v":0},{"$f":"SUM(F10:O10)","v":42}]
[null,null,null,3,{"$f":"INDEX(PigCats,PigNo!D11)","v":"Gest Sows"},{"$f":"SUMIF(PigDetails!$H$18:$BE$18,PigNo!F$8&PigNo!$E11,PigDetails!$H$19:$BE$19)","v":843},{"$f":"SUMIF(PigDetails!$H$18:$BE$18,PigNo!G$8&PigNo!$E11,PigDetails!$H$19:$BE$19)","v":0},{"$f":"SUMIF(PigDetails!$H$18:$BE$18,PigNo!H$8&PigNo!$E11,PigDetails!$H$19:$BE$19)","v":0},{"$f":"SUMIF(PigDetails!$H$18:$BE$18,PigNo!I$8&PigNo!$E11,PigDetails!$H$19:$BE$19)","v":0},{"$f":"SUMIF(PigDetails!$H$18:$BE$18,PigNo!J$8&PigNo!$E11,PigDetails!$H$19:$BE$19)","v":0},{"$f":"SUMIF(PigDetails!$H$18:$BE$18,PigNo!K$8&PigNo!$E11,PigDetails!$H$19:$BE$19)","v":0},{"$f":"SUMIF(PigDetails!$H$18:$BE$18,PigNo!L$8&PigNo!$E11,PigDetails!$H$19:$BE$19)","v":0},{"$f":"SUMIF(PigDetails!$H$18:$BE$18,PigNo!M$8&PigNo!$E11,PigDetails!$H$19:$BE$19)","v":0},{"$f":"SUMIF(PigDetails!$H$18:$BE$18,PigNo!N$8&PigNo!$E11,PigDetails!$H$19:$BE$19)","v":0},{"$f":"SUMIF(PigDetails!$H$18:$BE$18,PigNo!O$8&PigNo!$E11,PigDetails!$H$19:$BE$19)","v":0},843]
[null,null,null,4,{"$f":"INDEX(PigCats,PigNo!D12)","v":"Lac Sows"},{"$f":"SUMIF(PigDetails!$H$18:$BE$18,PigNo!F$8&PigNo!$E12,PigDetails!$H$19:$BE$19)","v":157},{"$f":"SUMIF(PigDetails!$H$18:$BE$18,PigNo!G$8&PigNo!$E12,PigDetails!$H$19:$BE$19)","v":0},{"$f":"SUMIF(PigDetails!$H$18:$BE$18,PigNo!H$8&PigNo!$E12,PigDetails!$H$19:$BE$19)","v":0},{"$f":"SUMIF(PigDetails!$H$18:$BE$18,PigNo!I$8&PigNo!$E12,PigDetails!$H$19:$BE$19)","v":0},{"$f":"SUMIF(PigDetails!$H$18:$BE$18,PigNo!J$8&PigNo!$E12,PigDetails!$H$19:$BE$19)","v":0},{"$f":"SUMIF(PigDetails!$H$18:$BE$18,PigNo!K$8&PigNo!$E12,PigDetails!$H$19:$BE$19)","v":0},{"$f":"SUMIF(PigDetails!$H$18:$BE$18,PigNo!L$8&PigNo!$E12,PigDetails!$H$19:$BE$19)","v":0},{"$f":"SUMIF(PigDetails!$H$18:$BE$18,PigNo!M$8&PigNo!$E12,PigDetails!$H$19:$BE$19)","v":0},{"$f":"SUMIF(PigDetails!$H$18:$BE$18,PigNo!N$8&PigNo!$E12,PigDetails!$H$19:$BE$19)","v":0},{"$f":"SUMIF(PigDetails!$H$18:$BE$18,PigNo!O$8&PigNo!$E12,PigDetails!$H$19:$BE$19)","v":0},157]
[null,null,null,5,{"$f":"INDEX(PigCats,PigNo!D13)","v":"Suckers"},{"$f":"SUMIF(PigDetails!$H$18:$BE$18,PigNo!F$8&PigNo!$E13,PigDetails!$H$19:$BE$19)","v":1497},{"$f":"SUMIF(PigDetails!$H$18:$BE$18,PigNo!G$8&PigNo!$E13,PigDetails!$H$19:$BE$19)","v":0},{"$f":"SUMIF(PigDetails!$H$18:$BE$18,PigNo!H$8&PigNo!$E13,PigDetails!$H$19:$BE$19)","v":0},{"$f":"SUMIF(PigDetails!$H$18:$BE$18,PigNo!I$8&PigNo!$E13,PigDetails!$H$19:$BE$19)","v":0},{"$f":"SUMIF(PigDetails!$H$18:$BE$18,PigNo!J$8&PigNo!$E13,PigDetails!$H$19:$BE$19)","v":0},{"$f":"SUMIF(PigDetails!$H$18:$BE$18,PigNo!K$8&PigNo!$E13,PigDetails!$H$19:$BE$19)","v":0},{"$f":"SUMIF(PigDetails!$H$18:$BE$18,PigNo!L$8&PigNo!$E13,PigDetails!$H$19:$BE$19)","v":0},{"$f":"SUMIF(PigDetails!$H$18:$BE$18,PigNo!M$8&PigNo!$E13,PigDetails!$H$19:$BE$19)","v":0},{"$f":"SUMIF(PigDetails!$H$18:$BE$18,PigNo!N$8&PigNo!$E13,PigDetails!$H$19:$BE$19)","v":0},{"$f":"SUMIF(PigDetails!$H$18:$BE$18,PigNo!O$8&PigNo!$E13,PigDetails!$H$19:$BE$19)","v":0},1497]
[null,null,null,6,{"$f":"INDEX(PigCats,PigNo!D14)","v":"Weaners"},{"$f":"SUMIF(PigDetails!$H$18:$BE$18,PigNo!F$8&PigNo!$E14,PigDetails!$H$19:$BE$19)","v":0},{"$f":"SUMIF(PigDetails!$H$18:$BE$18,PigNo!G$8&PigNo!$E14,PigDetails!$H$19:$BE$19)","v":2295},{"$f":"SUMIF(PigDetails!$H$18:$BE$18,PigNo!H$8&PigNo!$E14,PigDetails!$H$19:$BE$19)","v":0},{"$f":"SUMIF(PigDetails!$H$18:$BE$18,PigNo!I$8&PigNo!$E14,PigDetails!$H$19:$BE$19)","v":0},{"$f":"SUMIF(PigDetails!$H$18:$BE$18,PigNo!J$8&PigNo!$E14,PigDetails!$H$19:$BE$19)","v":0},{"$f":"SUMIF(PigDetails!$H$18:$BE$18,PigNo!K$8&PigNo!$E14,PigDetails!$H$19:$BE$19)","v":0},{"$f":"SUMIF(PigDetails!$H$18:$BE$18,PigNo!L$8&PigNo!$E14,PigDetails!$H$19:$BE$19)","v":0},{"$f":"SUMIF(PigDetails!$H$18:$BE$18,PigNo!M$8&PigNo!$E14,PigDetails!$H$19:$BE$19)","v":0},{"$f":"SUMIF(PigDetails!$H$18:$BE$18,PigNo!N$8&PigNo!$E14,PigDetails!$H$19:$BE$19)","v":0},{"$f":"SUMIF(PigDetails!$H$18:$BE$18,PigNo!O$8&PigNo!$E14,PigDetails!$H$19:$BE$19)","v":0},2295]
[null,null,null,7,{"$f":"INDEX(PigCats,PigNo!D15)","v":"Growers"},{"$f":"SUMIF(PigDetails!$H$18:$BE$18,PigNo!F$8&PigNo!$E15,PigDetails!$H$19:$BE$19)","v":0},{"$f":"SUMIF(PigDetails!$H$18:$BE$18,PigNo!G$8&PigNo!$E15,PigDetails!$H$19:$BE$19)","v":0},{"$f":"SUMIF(PigDetails!$H$18:$BE$18,PigNo!H$8&PigNo!$E15,PigDetails!$H$19:$BE$19)","v":2152},{"$f":"SUMIF(PigDetails!$H$18:$BE$18,PigNo!I$8&PigNo!$E15,PigDetails!$H$19:$BE$19)","v":0},{"$f":"SUMIF(PigDetails!$H$18:$BE$18,PigNo!J$8&PigNo!$E15,PigDetails!$H$19:$BE$19)","v":0},{"$f":"SUMIF(PigDetails!$H$18:$BE$18,PigNo!K$8&PigNo!$E15,PigDetails!$H$19:$BE$19)","v":0},{"$f":"SUMIF(PigDetails!$H$18:$BE$18,PigNo!L$8&PigNo!$E15,PigDetails!$H$19:$BE$19)","v":0},{"$f":"SUMIF(PigDetails!$H$18:$BE$18,PigNo!M$8&PigNo!$E15,PigDetails!$H$19:$BE$19)","v":0},{"$f":"SUMIF(PigDetails!$H$18:$BE$18,PigNo!N$8&PigNo!$E15,PigDetails!$H$19:$BE$19)","v":0},{"$f":"SUMIF(PigDetails!$H$18:$BE$18,PigNo!O$8&PigNo!$E15,PigDetails!$H$19:$BE$19)","v":0},2152]
[null,null,null,8,{"$f":"INDEX(PigCats,PigNo!D16)","v":"Finishers"},{"$f":"SUMIF(PigDetails!$H$18:$BE$18,PigNo!F$8&PigNo!$E16,PigDetails!$H$19:$BE$19)","v":0},{"$f":"SUMIF(PigDetails!$H$18:$BE$18,PigNo!G$8&PigNo!$E16,PigDetails!$H$19:$BE$19)","v":0},{"$f":"SUMIF(PigDetails!$H$18:$BE$18,PigNo!H$8&PigNo!$E16,PigDetails!$H$19:$BE$19)","v":2140},{"$f":"SUMIF(PigDetails!$H$18:$BE$18,PigNo!I$8&PigNo!$E16,PigDetails!$H$19:$BE$19)","v":0},{"$f":"SUMIF(PigDetails!$H$18:$BE$18,PigNo!J$8&PigNo!$E16,PigDetails!$H$19:$BE$19)","v":0},{"$f":"SUMIF(PigDetails!$H$18:$BE$18,PigNo!K$8&PigNo!$E16,PigDetails!$H$19:$BE$19)","v":0},{"$f":"SUMIF(PigDetails!$H$18:$BE$18,PigNo!L$8&PigNo!$E16,PigDetails!$H$19:$BE$19)","v":0},{"$f":"SUMIF(PigDetails!$H$18:$BE$18,PigNo!M$8&PigNo!$E16,PigDetails!$H$19:$BE$19)","v":0},{"$f":"SUMIF(PigDetails!$H$18:$BE$18,PigNo!N$8&PigNo!$E16,PigDetails!$H$19:$BE$19)","v":0},{"$f":"SUMIF(PigDetails!$H$18:$BE$18,PigNo!O$8&PigNo!$E16,PigDetails!$H$19:$BE$19)","v":0},2140]
[null,null,null,9,{"$f":"INDEX(PigCats,PigNo!D17)","v":0},{"$f":"SUMIF(PigDetails!$H$18:$BE$18,PigNo!F$8&PigNo!$E17,PigDetails!$H$19:$BE$19)","v":0},{"$f":"SUMIF(PigDetails!$H$18:$BE$18,PigNo!G$8&PigNo!$E17,PigDetails!$H$19:$BE$19)","v":0},{"$f":"SUMIF(PigDetails!$H$18:$BE$18,PigNo!H$8&PigNo!$E17,PigDetails!$H$19:$BE$19)","v":0},{"$f":"SUMIF(PigDetails!$H$18:$BE$18,PigNo!I$8&PigNo!$E17,PigDetails!$H$19:$BE$19)","v":0},{"$f":"SUMIF(PigDetails!$H$18:$BE$18,PigNo!J$8&PigNo!$E17,PigDetails!$H$19:$BE$19)","v":0},{"$f":"SUMIF(PigDetails!$H$18:$BE$18,PigNo!K$8&PigNo!$E17,PigDetails!$H$19:$BE$19)","v":0},{"$f":"SUMIF(PigDetails!$H$18:$BE$18,PigNo!L$8&PigNo!$E17,PigDetails!$H$19:$BE$19)","v":0},{"$f":"SUMIF(PigDetails!$H$18:$BE$18,PigNo!M$8&PigNo!$E17,PigDetails!$H$19:$BE$19)","v":0},{"$f":"SUMIF(PigDetails!$H$18:$BE$18,PigNo!N$8&PigNo!$E17,PigDetails!$H$19:$BE$19)","v":0},{"$f":"SUMIF(PigDetails!$H$18:$BE$18,PigNo!O$8&PigNo!$E17,PigDetails!$H$19:$BE$19)","v":0},0]
[null,null,null,10,{"$f":"INDEX(PigCats,PigNo!D18)","v":0},{"$f":"SUMIF(PigDetails!$H$18:$BE$18,PigNo!F$8&PigNo!$E18,PigDetails!$H$19:$BE$19)","v":0},{"$f":"SUMIF(PigDetails!$H$18:$BE$18,PigNo!G$8&PigNo!$E18,PigDetails!$H$19:$BE$19)","v":0},{"$f":"SUMIF(PigDetails!$H$18:$BE$18,PigNo!H$8&PigNo!$E18,PigDetails!$H$19:$BE$19)","v":0},{"$f":"SUMIF(PigDetails!$H$18:$BE$18,PigNo!I$8&PigNo!$E18,PigDetails!$H$19:$BE$19)","v":0},{"$f":"SUMIF(PigDetails!$H$18:$BE$18,PigNo!J$8&PigNo!$E18,PigDetails!$H$19:$BE$19)","v":0},{"$f":"SUMIF(PigDetails!$H$18:$BE$18,PigNo!K$8&PigNo!$E18,PigDetails!$H$19:$BE$19)","v":0},{"$f":"SUMIF(PigDetails!$H$18:$BE$18,PigNo!L$8&PigNo!$E18,PigDetails!$H$19:$BE$19)","v":0},{"$f":"SUMIF(PigDetails!$H$18:$BE$18,PigNo!M$8&PigNo!$E18,PigDetails!$H$19:$BE$19)","v":0},{"$f":"SUMIF(PigDetails!$H$18:$BE$18,PigNo!N$8&PigNo!$E18,PigDetails!$H$19:$BE$19)","v":0},{"$f":"SUMIF(PigDetails!$H$18:$BE$18,PigNo!O$8&PigNo!$E18,PigDetails!$H$19:$BE$19)","v":0},0]
[null,null,null,null,"Total",{"$f":"SUM(F9:F18)","v":2589},{"$f":"SUM(G9:G18)","v":2295},4292,0,0,0,0,0,0,0,9176]

{"sheet":"Report","index":5,"n_rows":92,"n_cols":18,"rows_kept":92,"cut":false,"hidden":false,"merged":[[2,2,6,5],[2,6,3,18],[4,6,4,17]]}
[null,null,null,null,null,null,{"$f":"IF(G7=0,\"*\",\"\")","v":""},{"$f":"IF(H7=0,\"*\",\"\")","v":""},"","*","*","*","*","*","*","*"]
[]
[null,null,"PigGas",null,null,null,{"$f":"FarmDesign!H9","v":"Harry's Happy Hogs"}]
[]
[null,null,null,null,null,null,{"$f":"FarmDesign!H11","v":"1000 sow multisite"}]
[null,null,null,null,null,null,1,2,3,4,5,6,7,8,9,10,null,"Total"]
[null,null,null,null,null,null,{"$f":"INDEX(UnitName,G6)","v":"Breeder"},"Weaner","GrowOut",0,0,0,0,0,0,0]
[]
[null,null,null,"PRODUCTION DETAILS"]
[]
[null,null,null,null,"Total Sales",null,{"$f":"SUMIF(PigMovements!$G$10:$AT$10,Report!G$7,PigMovements!$G86:$AT86)","v":328},{"$f":"SUMIF(PigMovements!$G$10:$AT$10,Report!H$7,PigMovements!$G86:$AT86)","v":0},{"$f":"SUMIF(PigMovements!$G$10:$AT$10,Report!I$7,PigMovements!$G86:$AT86)","v":18315},{"$f":"SUMIF(PigMovements!$G$10:$AT$10,Report!J$7,PigMovements!$G86:$AT86)","v":0},{"$f":"SUMIF(PigMovements!$G$10:$AT$10,Report!K$7,PigMovements!$G86:$AT86)","v":0},{"$f":"SUMIF(PigMovements!$G$10:$AT$10,Report!L$7,PigMovements!$G86:$AT86)","v":0},{"$f":"SUMIF(PigMovements!$G$10:$AT$10,Report!M$7,PigMovements!$G86:$AT86)","v":0},{"$f":"SUMIF(PigMovements!$G$10:$AT$10,Report!N$7,PigMovements!$G86:$AT86)","v":0},{"$f":"SUMIF(PigMovements!$G$10:$AT$10,Report!O$7,PigMovements!$G86:$AT86)","v":0},{"$f":"SUMIF(PigMovements!$G$10:$AT$10,Report!P$7,PigMovements!$G86:$AT86)","v":0},null,{"$f":"SUM(G11:P11)","v":18643}]
[null,null,null,null,null,"Sales Live Wt. kg",{"$f":"SUMIF(PigMovements!$G$10:$AT$10,Report!G$7,PigMovements!$G87:$AT87)","v":74430},{"$f":"SUMIF(PigMovements!$G$10:$AT$10,Report!H$7,PigMovements!$G87:$AT87)","v":0},{"$f":"SUMIF(PigMovements!$G$10:$AT$10,Report!I$7,PigMovements!$G87:$AT87)","v":1739925},{"$f":"SUMIF(PigMovements!$G$10:$AT$10,Report!J$7,PigMovements!$G87:$AT87)","v":0},{"$f":"SUMIF(PigMovements!$G$10:$AT$10,Report!K$7,PigMovements!$G87:$AT87)","v":0},{"$f":"SUMIF(PigMovements!$G$10:$AT$10,Report!L$7,PigMovements!$G87:$AT87)","v":0},{"$f":"SUMIF(PigMovements!$G$10:$AT$10,Report!M$7,PigMovements!$G87:$AT87)","v":0},{"$f":"SUMIF(PigMovements!$G$10:$AT$10,Report!N$7,PigMovements!$G87:$AT87)","v":0},{"$f":"SUMIF(PigMovements!$G$10:$AT$10,Report!O$7,PigMovements!$G87:$AT87)","v":0},{"$f":"SUMIF(PigMovements!$G$10:$AT$10,Report!P$7,PigMovements!$G87:$AT87)","v":0},null,{"$f":"SUM(G12:P12)","v":1814355}]
[null,null,null,null,null,"Sales Dress Wt. kg",{"$f":"SUMIF(PigMovements!$G$10:$AT$10,Report!G$7,PigMovements!$G88:$AT88)","v":56566.8},{"$f":"SUMIF(PigMovements!$G$10:$AT$10,Report!H$7,PigMovements!$G88:$AT88)","v":0},{"$f":"SUMIF(PigMovements!$G$10:$AT$10,Report!I$7,PigMovements!$G88:$AT88)","v":1322343},{"$f":"SUMIF(PigMovements!$G$10:$AT$10,Report!J$7,PigMovements!$G88:$AT88)","v":0},{"$f":"SUMIF(PigMovements!$G$10:$AT$10,Report!K$7,PigMovements!$G88:$AT88)","v":0},{"$f":"SUMIF(PigMovements!$G$10:$AT$10,Report!L$7,PigMovements!$G88:$AT88)","v":0},{"$f":"SUMIF(PigMovements!$G$10:$AT$10,Report!M$7,PigMovements!$G88:$AT88)","v":0},{"$f":"SUMIF(PigMovements!$G$10:$AT$10,Report!N$7,PigMovements!$G88:$AT88)","v":0},{"$f":"SUMIF(PigMovements!$G$10:$AT$10,Report!O$7,PigMovements!$G88:$AT88)","v":0},{"$f":"SUMIF(PigMovements!$G$10:$AT$10,Report!P$7,PigMovements!$G88:$AT88)","v":0},null,{"$f":"SUM(G13:P13)","v":1378909.8}]
[null,null,null,null,null,"Average Dress Wt. kg",{"$f":"IF(G11<>0,G13/G11,\"\")","v":172.45975609756098},{"$f":"IF(H11<>0,H13/H11,\"\")","v":""},72.2,"","","","","","","",null,{"$f":"R13/R11","v":73.963943571313635}]
[null,null,null,null,null,"Dress %",{"$f":"IF(G12<>0,G13/G12,0)","v":0.76},{"$f":"IF(H12<>0,H13/H12,0)","v":0},0.76,0,0,0,0,0,0,0,null,0.76]
[]
[{"$f":"IF(SUM(G17:P23)=0,\"*\",\"\")","v":""},null,null,null,"Transfer Out",null,{"$f":"SUMIF(PigMovements!$G$10:$AT$10,Report!G$7,PigMovements!$G171:$AT171)","v":19500},{"$f":"SUMIF(PigMovements!$G$10:$AT$10,Report!H$7,PigMovements!$G171:$AT171)","v":18993},{"$f":"SUMIF(PigMovements!$G$10:$AT$10,Report!I$7,PigMovements!$G171:$AT171)","v":0},{"$f":"SUMIF(PigMovements!$G$10:$AT$10,Report!J$7,PigMovements!$G171:$AT171)","v":0},{"$f":"SUMIF(PigMovements!$G$10:$AT$10,Report!K$7,PigMovements!$G171:$AT171)","v":0},{"$f":"SUMIF(PigMovements!$G$10:$AT$10,Report!L$7,PigMovements!$G171:$AT171)","v":0},{"$f":"SUMIF(PigMovements!$G$10:$AT$10,Report!M$7,PigMovements!$G171:$AT171)","v":0},{"$f":"SUMIF(PigMovements!$G$10:$AT$10,Report!N$7,PigMovements!$G171:$AT171)","v":0},{"$f":"SUMIF(PigMovements!$G$10:$AT$10,Report!O$7,PigMovements!$G171:$AT171)","v":0},{"$f":"SUMIF(PigMovements!$G$10:$AT$10,Report!P$7,PigMovements!$G171:$AT171)","v":0},null,{"$f":"SUM(G17:P17)","v":38493}]
[{"$f":"A17","v":""},null,null,null,null,"Transfer Live Wt. kg",{"$f":"SUMIF(PigMovements!$G$10:$AT$10,Report!G$7,PigMovements!$G172:$AT172)","v":156000},{"$f":"SUMIF(PigMovements!$G$10:$AT$10,Report!H$7,PigMovements!$G172:$AT172)","v":474825},{"$f":"SUMIF(PigMovements!$G$10:$AT$10,Report!I$7,PigMovements!$G172:$AT172)","v":0},{"$f":"SUMIF(PigMovements!$G$10:$AT$10,Report!J$7,PigMovements!$G172:$AT172)","v":0},{"$f":"SUMIF(PigMovements!$G$10:$AT$10,Report!K$7,PigMovements!$G172:$AT172)","v":0},{"$f":"SUMIF(PigMovements!$G$10:$AT$10,Report!L$7,PigMovements!$G172:$AT172)","v":0},{"$f":"SUMIF(PigMovements!$G$10:$AT$10,Report!M$7,PigMovements!$G172:$AT172)","v":0},{"$f":"SUMIF(PigMovements!$G$10:$AT$10,Report!N$7,PigMovements!$G172:$AT172)","v":0},{"$f":"SUMIF(PigMovements!$G$10:$AT$10,Report!O$7,PigMovements!$G172:$AT172)","v":0},{"$f":"SUMIF(PigMovements!$G$10:$AT$10,Report!P$7,PigMovements!$G172:$AT172)","v":0},null,{"$f":"SUM(G18:P18)","v":630825}]
[{"$f":"A18","v":""},null,null,null,null,"Transfer Dress Wt. kg",{"$f":"SUMIF(PigMovements!$G$10:$AT$10,Report!G$7,PigMovements!$G173:$AT173)","v":118248},{"$f":"SUMIF(PigMovements!$G$10:$AT$10,Report!H$7,PigMovements!$G173:$AT173)","v":359917.35},{"$f":"SUMIF(PigMovements!$G$10:$AT$10,Report!I$7,PigMovements!$G173:$AT173)","v":0},{"$f":"SUMIF(PigMovements!$G$10:$AT$10,Report!J$7,PigMovements!$G173:$AT173)","v":0},{"$f":"SUMIF(PigMovements!$G$10:$AT$10,Report!K$7,PigMovements!$G173:$AT173)","v":0},{"$f":"SUMIF(PigMovements!$G$10:$AT$10,Report!L$7,PigMovements!$G173:$AT173)","v":0},{"$f":"SUMIF(PigMovements!$G$10:$AT$10,Report!M$7,PigMovements!$G173:$AT173)","v":0},{"$f":"SUMIF(PigMovements!$G$10:$AT$10,Report!N$7,PigMovements!$G173:$AT173)","v":0},{"$f":"SUMIF(PigMovements!$G$10:$AT$10,Report!O$7,PigMovements!$G173:$AT173)","v":0},{"$f":"SUMIF(PigMovements!$G$10:$AT$10,Report!P$7,PigMovements!$G173:$AT173)","v":0},null,{"$f":"SUM(G19:P19)","v":478165.35}]
[""]
["",null,null,null,"Transfer In",null,{"$f":"SUMIF(PigMovements!$G$96:$AT$96,Report!G$7,PigMovements!$G171:$AT171)","v":0},{"$f":"SUMIF(PigMovements!$G$96:$AT$96,Report!H$7,PigMovements!$G171:$AT171)","v":19500},{"$f":"SUMIF(PigMovements!$G$96:$AT$96,Report!I$7,PigMovements!$G171:$AT171)","v":18993},{"$f":"SUMIF(PigMovements!$G$96:$AT$96,Report!J$7,PigMovements!$G171:$AT171)","v":0},{"$f":"SUMIF(PigMovements!$G$96:$AT$96,Report!K$7,PigMovements!$G171:$AT171)","v":0},{"$f":"SUMIF(PigMovements!$G$96:$AT$96,Report!L$7,PigMovements!$G171:$AT171)","v":0},{"$f":"SUMIF(PigMovements!$G$96:$AT$96,Report!M$7,PigMovements!$G171:$AT171)","v":0},{"$f":"SUMIF(PigMovements!$G$96:$AT$96,Report!N$7,PigMovements!$G171:$AT171)","v":0},{"$f":"SUMIF(PigMovements!$G$96:$AT$96,Report!O$7,PigMovements!$G171:$AT171)","v":0},{"$f":"SUMIF(PigMovements!$G$96:$AT$96,Report!P$7,PigMovements!$G171:$AT171)","v":0},null,{"$f":"SUM(G21:P21)","v":38493}]
["",null,null,null,null,"Transfer Live Wt. kg",{"$f":"SUMIF(PigMovements!$G$96:$AT$96,Report!G$7,PigMovements!$G172:$AT172)","v":0},{"$f":"SUMIF(PigMovements!$G$96:$AT$96,Report!H$7,PigMovements!$G172:$AT172)","v":156000},{"$f":"SUMIF(PigMovements!$G$96:$AT$96,Report!I$7,PigMovements!$G172:$AT172)","v":474825},{"$f":"SUMIF(PigMovements!$G$96:$AT$96,Report!J$7,PigMovements!$G172:$AT172)","v":0},{"$f":"SUMIF(PigMovements!$G$96:$AT$96,Report!K$7,PigMovements!$G172:$AT172)","v":0},{"$f":"SUMIF(PigMovements!$G$96:$AT$96,Report!L$7,PigMovements!$G172:$AT172)","v":0},{"$f":"SUMIF(PigMovements!$G$96:$AT$96,Report!M$7,PigMovements!$G172:$AT172)","v":0},{"$f":"SUMIF(PigMovements!$G$96:$AT$96,Report!N$7,PigMovements!$G172:$AT172)","v":0},{"$f":"SUMIF(PigMovements!$G$96:$AT$96,Report!O$7,PigMovements!$G172:$AT172)","v":0},{"$f":"SUMIF(PigMovements!$G$96:$AT$96,Report!P$7,PigMovements!$G172:$AT172)","v":0},null,{"$f":"SUM(G22:P22)","v":630825}]
["",null,null,null,null,"Transfer Dress Wt. kg",{"$f":"SUMIF(PigMovements!$G$96:$AT$96,Report!G$7,PigMovements!$G173:$AT173)","v":0},{"$f":"SUMIF(PigMovements!$G$96:$AT$96,Report!H$7,PigMovements!$G173:$AT173)","v":118248},{"$f":"SUMIF(PigMovements!$G$96:$AT$96,Report!I$7,PigMovements!$G173:$AT173)","v":359917.35},{"$f":"SUMIF(PigMovements!$G$96:$AT$96,Report!J$7,PigMovements!$G173:$AT173)","v":0},{"$f":"SUMIF(PigMovements!$G$96:$AT$96,Report!K$7,PigMovements!$G173:$AT173)","v":0},{"$f":"SUMIF(PigMovements!$G$96:$AT$96,Report!L$7,PigMovements!$G173:$AT173)","v":0},{"$f":"SUMIF(PigMovements!$G$96:$AT$96,Report!M$7,PigMovements!$G173:$AT173)","v":0},{"$f":"SUMIF(PigMovements!$G$96:$AT$96,Report!N$7,PigMovements!$G173:$AT173)","v":0},{"$f":"SUMIF(PigMovements!$G$96:$AT$96,Report!O$7,PigMovements!$G173:$AT173)","v":0},{"$f":"SUMIF(PigMovements!$G$96:$AT$96,Report!P$7,PigMovements!$G173:$AT173)","v":0},null,{"$f":"SUM(G23:P23)","v":478165.35}]
[]
[null,null,null,null,"Purchases",null,{"$f":"SUMIF(PigMovements!$G$10:$AT$10,Report!G$7,PigMovements!$G256:$AT256)","v":0},{"$f":"SUMIF(PigMovements!$G$10:$AT$10,Report!H$7,PigMovements!$G256:$AT256)","v":0},{"$f":"SUMIF(PigMovements!$G$10:$AT$10,Report!I$7,PigMovements!$G256:$AT256)","v":0},{"$f":"SUMIF(PigMovements!$G$10:$AT$10,Report!J$7,PigMovements!$G256:$AT256)","v":0},{"$f":"SUMIF(PigMovements!$G$10:$AT$10,Report!K$7,PigMovements!$G256:$AT256)","v":0},{"$f":"SUMIF(PigMovements!$G$10:$AT$10,Report!L$7,PigMovements!$G256:$AT256)","v":0},{"$f":"SUMIF(PigMovements!$G$10:$AT$10,Report!M$7,PigMovements!$G256:$AT256)","v":0},{"$f":"SUMIF(PigMovements!$G$10:$AT$10,Report!N$7,PigMovements!$G256:$AT256)","v":0},{"$f":"SUMIF(PigMovements!$G$10:$AT$10,Report!O$7,PigMovements!$G256:$AT256)","v":0},{"$f":"SUMIF(PigMovements!$G$10:$AT$10,Report!P$7,PigMovements!$G256:$AT256)","v":0},null,{"$f":"SUM(G25:P25)","v":0}]
[null,null,null,null,null,"Purchase Live Wt. kg",{"$f":"SUMIF(PigMovements!$G$10:$AT$10,Report!G$7,PigMovements!$G257:$AT257)","v":0},{"$f":"SUMIF(PigMovements!$G$10:$AT$10,Report!H$7,PigMovements!$G257:$AT257)","v":0},{"$f":"SUMIF(PigMovements!$G$10:$AT$10,Report!I$7,PigMovements!$G257:$AT257)","v":0},{"$f":"SUMIF(PigMovements!$G$10:$AT$10,Report!J$7,PigMovements!$G257:$AT257)","v":0},{"$f":"SUMIF(PigMovements!$G$10:$AT$10,Report!K$7,PigMovements!$G257:$AT257)","v":0},{"$f":"SUMIF(PigMovements!$G$10:$AT$10,Report!L$7,PigMovements!$G257:$AT257)","v":0},{"$f":"SUMIF(PigMovements!$G$10:$AT$10,Report!M$7,PigMovements!$G257:$AT257)","v":0},{"$f":"SUMIF(PigMovements!$G$10:$AT$10,Report!N$7,PigMovements!$G257:$AT257)","v":0},{"$f":"SUMIF(PigMovements!$G$10:$AT$10,Report!O$7,PigMovements!$G257:$AT257)","v":0},{"$f":"SUMIF(PigMovements!$G$10:$AT$10,Report!P$7,PigMovements!$G257:$AT257)","v":0},null,{"$f":"SUM(G26:P26)","v":0}]
[null,null,null,null,null,"Purchase Dressed Wt. kg",{"$f":"SUMIF(PigMovements!$G$10:$AT$10,Report!G$7,PigMovements!$G258:$AT258)","v":0},{"$f":"SUMIF(PigMovements!$G$10:$AT$10,Report!H$7,PigMovements!$G258:$AT258)","v":0},{"$f":"SUMIF(PigMovements!$G$10:$AT$10,Report!I$7,PigMovements!$G258:$AT258)","v":0},{"$f":"SUMIF(PigMovements!$G$10:$AT$10,Report!J$7,PigMovements!$G258:$AT258)","v":0},{"$f":"SUMIF(PigMovements!$G$10:$AT$10,Report!K$7,PigMovements!$G258:$AT258)","v":0},{"$f":"SUMIF(PigMovements!$G$10:$AT$10,Report!L$7,PigMovements!$G258:$AT258)","v":0},{"$f":"SUMIF(PigMovements!$G$10:$AT$10,Report!M$7,PigMovements!$G258:$AT258)","v":0},{"$f":"SUMIF(PigMovements!$G$10:$AT$10,Report!N$7,PigMovements!$G258:$AT258)","v":0},{"$f":"SUMIF(PigMovements!$G$10:$AT$10,Report!O$7,PigMovements!$G258:$AT258)","v":0},{"$f":"SUMIF(PigMovements!$G$10:$AT$10,Report!P$7,PigMovements!$G258:$AT258)","v":0},null,{"$f":"SUM(G27:P27)","v":0}]
[]
[null,null,null,null,"Net Pig Movements",null,{"$f":"G11+G17-G25-G21","v":19828},{"$f":"H11+H17-H25-H21","v":-507},-678,0,0,0,0,0,0,0,null,{"$f":"SUM(G29:P29)","v":18643}]
[null,null,null,null,null,"Sales Live Wt. kg",{"$f":"G12+G18-G26-G22","v":230430},318825,1265100,0,0,0,0,0,0,0,null,{"$f":"SUM(G30:P30)","v":1814355}]
[null,null,null,null,null,"Sales Dress Wt. kg",174814.8,241669.34999999998,962425.65,0,0,0,0,0,0,0,null,{"$f":"SUM(G31:P31)","v":1378909.8}]
[null,null,null,null,null,"Dress %",{"$f":"IF(G30<>0,G31/G30,\"\")","v":0.75864600963416218},{"$f":"IF(H30<>0,H31/H30,\"\")","v":0.7579999999999999},0.76075065212236193,"","","","","","","",null,0.76]
[]
[null,null,null,null,"Feed Consumption (kg)",null,{"$f":"SUMIF(PigDetails!$H$15:$BE$15,Report!G$7,PigDetails!$H$95:$BE$95)*1000","v":1176557.9099999999},{"$f":"SUMIF(PigDetails!$H$15:$BE$15,Report!H$7,PigDetails!$H$95:$BE$95)*1000","v":737658.9},{"$f":"SUMIF(PigDetails!$H$15:$BE$15,Report!I$7,PigDetails!$H$95:$BE$95)*1000","v":3367166.6999999997},{"$f":"SUMIF(PigDetails!$H$15:$BE$15,Report!J$7,PigDetails!$H$95:$BE$95)*1000","v":0},{"$f":"SUMIF(PigDetails!$H$15:$BE$15,Report!K$7,PigDetails!$H$95:$BE$95)*1000","v":0},{"$f":"SUMIF(PigDetails!$H$15:$BE$15,Report!L$7,PigDetails!$H$95:$BE$95)*1000","v":0},{"$f":"SUMIF(PigDetails!$H$15:$BE$15,Report!M$7,PigDetails!$H$95:$BE$95)*1000","v":0},{"$f":"SUMIF(PigDetails!$H$15:$BE$15,Report!N$7,PigDetails!$H$95:$BE$95)*1000","v":0},{"$f":"SUMIF(PigDetails!$H$15:$BE$15,Report!O$7,PigDetails!$H$95:$BE$95)*1000","v":0},{"$f":"SUMIF(PigDetails!$H$15:$BE$15,Report!P$7,PigDetails!$H$95:$BE$95)*1000","v":0},null,{"$f":"SUM(G34:P34)","v":5281383.51}]
[]
[null,null,null,null,null,"FCR L.Wt",{"$f":"IF(G30<>0,G34/G30,0)","v":5.105923317276396},2.313679604798871,2.6615814560113824,0,0,0,0,0,0,0,null,{"$f":"IF(R30<>0,R34/R30,0)","v":2.9108876212207644}]
[null,null,null,null,null,"FCR D.Wt",{"$f":"IF(G31<>0,G34/G31,0)","v":6.7303106487551396},3.0523477635869014,3.4986252704299803,0,0,0,0,0,0,0,null,{"$f":"IF(R31<>0,R34/R31,0)","v":3.8301152910799527}]
[]
[null,null,null,"EMISSIONS PROFILE"]
[]
[null,null,null,null,"Pre-Farm Estimate (kg CO2-e)"]
[]
[null,null,null,null,null,"Grain",{"$f":"G34*GrainCO2/1000","v":294139.47749999998},184414.72500000001,841791.67499999993,0,0,0,0,0,0,0,null,{"$f":"R34*GrainCO2/1000","v":1320345.8774999999}]
[null,null,null,null,null,"Milling & Delivery ",{"$f":"G34*MIllingCO2/1000","v":56474.779679999992},35407.627200000003,161624.00159999999,0,0,0,0,0,0,0,null,{"$f":"R34*MIllingCO2/1000","v":253506.40847999998}]
[null,null,null,null,null,"Pig Freight",{"$f":"G25*UserAssumotions!$H$25","v":0},{"$f":"H25*UserAssumotions!$H$25","v":0},{"$f":"I25*UserAssumotions!$H$25","v":0},{"$f":"J25*UserAssumotions!$H$25","v":0},{"$f":"K25*UserAssumotions!$H$25","v":0},{"$f":"L25*UserAssumotions!$H$25","v":0},{"$f":"M25*UserAssumotions!$H$25","v":0},{"$f":"N25*UserAssumotions!$H$25","v":0},{"$f":"O25*UserAssumotions!$H$25","v":0},{"$f":"P25*UserAssumotions!$H$25","v":0},null,{"$f":"R25*UserAssumotions!$H$25","v":0}]
[null,null,null,null,null,"Straw & Bedding",{"$f":"SUMIF(PigDetails!$H$15:$BE$15,Report!G$7,PigDetails!$H$29:$BE$29)","v":0},{"$f":"SUMIF(PigDetails!$H$15:$BE$15,Report!H$7,PigDetails!$H$29:$BE$29)","v":10499.999999999998},{"$f":"SUMIF(PigDetails!$H$15:$BE$15,Report!I$7,PigDetails!$H$29:$BE$29)","v":0},{"$f":"SUMIF(PigDetails!$H$15:$BE$15,Report!J$7,PigDetails!$H$29:$BE$29)","v":0},{"$f":"SUMIF(PigDetails!$H$15:$BE$15,Report!K$7,PigDetails!$H$29:$BE$29)","v":0},{"$f":"SUMIF(PigDetails!$H$15:$BE$15,Report!L$7,PigDetails!$H$29:$BE$29)","v":0},{"$f":"SUMIF(PigDetails!$H$15:$BE$15,Report!M$7,PigDetails!$H$29:$BE$29)","v":0},{"$f":"SUMIF(PigDetails!$H$15:$BE$15,Report!N$7,PigDetails!$H$29:$BE$29)","v":0},{"$f":"SUMIF(PigDetails!$H$15:$BE$15,Report!O$7,PigDetails!$H$29:$BE$29)","v":0},{"$f":"SUMIF(PigDetails!$H$15:$BE$15,Report!P$7,PigDetails!$H$29:$BE$29)","v":0},null,{"$f":"SUM(G46:P46)","v":10499.999999999998}]
[]
[null,null,null,null,null,"Total Pre-Farm",{"$f":"SUM(G43:G46)","v":350614.25717999996},{"$f":"SUM(H43:H46)","v":230322.35220000002},1003415.6765999999,0,0,0,0,0,0,0,null,{"$f":"SUM(R43:R46)","v":1584352.2859799999}]
[]
[null,null,null,null,"On-Farm Estimate (kg CO2-e)"]
[]
[null,null,null,null,null,"Fuels & Energy"]
[null,null,null,null,null,"Purchased Electricity",{"$f":"SUMIF('Energy Entry'!$E$8:$E$57,\"E\"&Report!G$7,'Energy Entry'!$K$8:$K$57)","v":280350},{"$f":"SUMIF('Energy Entry'!$E$8:$E$57,\"E\"&Report!H$7,'Energy Entry'!$K$8:$K$57)","v":4272},{"$f":"SUMIF('Energy Entry'!$E$8:$E$57,\"E\"&Report!I$7,'Energy Entry'!$K$8:$K$57)","v":12905},{"$f":"SUMIF('Energy Entry'!$E$8:$E$57,\"E\"&Report!J$7,'Energy Entry'!$K$8:$K$57)","v":0},{"$f":"SUMIF('Energy Entry'!$E$8:$E$57,\"E\"&Report!K$7,'Energy Entry'!$K$8:$K$57)","v":0},{"$f":"SUMIF('Energy Entry'!$E$8:$E$57,\"E\"&Report!L$7,'Energy Entry'!$K$8:$K$57)","v":0},{"$f":"SUMIF('Energy Entry'!$E$8:$E$57,\"E\"&Report!M$7,'Energy Entry'!$K$8:$K$57)","v":0},{"$f":"SUMIF('Energy Entry'!$E$8:$E$57,\"E\"&Report!N$7,'Energy Entry'!$K$8:$K$57)","v":0},{"$f":"SUMIF('Energy Entry'!$E$8:$E$57,\"E\"&Report!O$7,'Energy Entry'!$K$8:$K$57)","v":0},{"$f":"SUMIF('Energy Entry'!$E$8:$E$57,\"E\"&Report!P$7,'Energy Entry'!$K$8:$K$57)","v":0},null,{"$f":"SUM(G53:P53)","v":297527}]
[null,null,null,null,null,"Fuel Stationary",{"$f":"SUMIF('Energy Entry'!$E$8:$E$57,\"S\"&Report!G$7,'Energy Entry'!$K$8:$K$57)","v":54649.764999999999},{"$f":"SUMIF('Energy Entry'!$E$8:$E$57,\"S\"&Report!H$7,'Energy Entry'!$K$8:$K$57)","v":13085.155000000001},{"$f":"SUMIF('Energy Entry'!$E$8:$E$57,\"S\"&Report!I$7,'Energy Entry'!$K$8:$K$57)","v":0},{"$f":"SUMIF('Energy Entry'!$E$8:$E$57,\"S\"&Report!J$7,'Energy Entry'!$K$8:$K$57)","v":0},{"$f":"SUMIF('Energy Entry'!$E$8:$E$57,\"S\"&Report!K$7,'Energy Entry'!$K$8:$K$57)","v":0},{"$f":"SUMIF('Energy Entry'!$E$8:$E$57,\"S\"&Report!L$7,'Energy Entry'!$K$8:$K$57)","v":0},{"$f":"SUMIF('Energy Entry'!$E$8:$E$57,\"S\"&Report!M$7,'Energy Entry'!$K$8:$K$57)","v":0},{"$f":"SUMIF('Energy Entry'!$E$8:$E$57,\"S\"&Report!N$7,'Energy Entry'!$K$8:$K$57)","v":0},{"$f":"SUMIF('Energy Entry'!$E$8:$E$57,\"S\"&Report!O$7,'Energy Entry'!$K$8:$K$57)","v":0},{"$f":"SUMIF('Energy Entry'!$E$8:$E$57,\"S\"&Report!P$7,'Energy Entry'!$K$8:$K$57)","v":0},null,{"$f":"SUM(G54:P54)","v":67734.92}]
[null,null,null,null,null,"Fuel Transport",{"$f":"SUMIF('Energy Entry'!$E$8:$E$57,\"T\"&Report!G$7,'Energy Entry'!$K$8:$K$57)","v":5237.3700000000008},{"$f":"SUMIF('Energy Entry'!$E$8:$E$57,\"T\"&Report!H$7,'Energy Entry'!$K$8:$K$57)","v":2364.7620000000002},{"$f":"SUMIF('Energy Entry'!$E$8:$E$57,\"T\"&Report!I$7,'Energy Entry'!$K$8:$K$57)","v":972.07500000000005},{"$f":"SUMIF('Energy Entry'!$E$8:$E$57,\"T\"&Report!J$7,'Energy Entry'!$K$8:$K$57)","v":0},{"$f":"SUMIF('Energy Entry'!$E$8:$E$57,\"T\"&Report!K$7,'Energy Entry'!$K$8:$K$57)","v":0},{"$f":"SUMIF('Energy Entry'!$E$8:$E$57,\"T\"&Report!L$7,'Energy Entry'!$K$8:$K$57)","v":0},{"$f":"SUMIF('Energy Entry'!$E$8:$E$57,\"T\"&Report!M$7,'Energy Entry'!$K$8:$K$57)","v":0},{"$f":"SUMIF('Energy Entry'!$E$8:$E$57,\"T\"&Report!N$7,'Energy Entry'!$K$8:$K$57)","v":0},{"$f":"SUMIF('Energy Entry'!$E$8:$E$57,\"T\"&Report!O$7,'Energy Entry'!$K$8:$K$57)","v":0},{"$f":"SUMIF('Energy Entry'!$E$8:$E$57,\"T\"&Report!P$7,'Energy Entry'!$K$8:$K$57)","v":0},null,{"$f":"SUM(G55:P55)","v":8574.2070000000022}]
[]
[null,null,null,null,null,"Total Fuels & Energy",{"$f":"SUM(G53:G55)","v":340237.13500000001},{"$f":"SUM(H53:H55)","v":19721.916999999998},13877.075000000001,0,0,0,0,0,0,0,null,373836.12699999998]
[]
[null,null,null,null,null,"Manure Management Systems (MMS) "]
[null,null,null,null,null,"Enteric CH4",{"$f":"SUMIF(PigDetails!$H$15:$BE$15,Report!G$7,PigDetails!$H$80:$BE$80)","v":42629.107651599043},{"$f":"SUMIF(PigDetails!$H$15:$BE$15,Report!H$7,PigDetails!$H$80:$BE$80)","v":26523.167154791376},{"$f":"SUMIF(PigDetails!$H$15:$BE$15,Report!I$7,PigDetails!$H$80:$BE$80)","v":116498.02314834081},{"$f":"SUMIF(PigDetails!$H$15:$BE$15,Report!J$7,PigDetails!$H$80:$BE$80)","v":0},{"$f":"SUMIF(PigDetails!$H$15:$BE$15,Report!K$7,PigDetails!$H$80:$BE$80)","v":0},{"$f":"SUMIF(PigDetails!$H$15:$BE$15,Report!L$7,PigDetails!$H$80:$BE$80)","v":0},{"$f":"SUMIF(PigDetails!$H$15:$BE$15,Report!M$7,PigDetails!$H$80:$BE$80)","v":0},{"$f":"SUMIF(PigDetails!$H$15:$BE$15,Report!N$7,PigDetails!$H$80:$BE$80)","v":0},{"$f":"SUMIF(PigDetails!$H$15:$BE$15,Report!O$7,PigDetails!$H$80:$BE$80)","v":0},{"$f":"SUMIF(PigDetails!$H$15:$BE$15,Report!P$7,PigDetails!$H$80:$BE$80)","v":0},null,{"$f":"SUM(G60:P60)","v":185650.29795473121}]
[null,null,null,null,null,"MMS-CH4",{"$f":"SUMIF(PigDetails!$H$15:$BE$15,Report!G$7,PigDetails!$H$65:$BE$65)","v":922948.0843897257},{"$f":"SUMIF(PigDetails!$H$15:$BE$15,Report!H$7,PigDetails!$H$65:$BE$65)","v":11399.10672585998},{"$f":"SUMIF(PigDetails!$H$15:$BE$15,Report!I$7,PigDetails!$H$65:$BE$65)","v":2788009.5753869973},{"$f":"SUMIF(PigDetails!$H$15:$BE$15,Report!J$7,PigDetails!$H$65:$BE$65)","v":0},{"$f":"SUMIF(PigDetails!$H$15:$BE$15,Report!K$7,PigDetails!$H$65:$BE$65)","v":0},{"$f":"SUMIF(PigDetails!$H$15:$BE$15,Report!L$7,PigDetails!$H$65:$BE$65)","v":0},{"$f":"SUMIF(PigDetails!$H$15:$BE$15,Report!M$7,PigDetails!$H$65:$BE$65)","v":0},{"$f":"SUMIF(PigDetails!$H$15:$BE$15,Report!N$7,PigDetails!$H$65:$BE$65)","v":0},{"$f":"SUMIF(PigDetails!$H$15:$BE$15,Report!O$7,PigDetails!$H$65:$BE$65)","v":0},{"$f":"SUMIF(PigDetails!$H$15:$BE$15,Report!P$7,PigDetails!$H$65:$BE$65)","v":0},null,3722356.7665025829]
[null,null,null,null,null,"MMS- Direct N2O",{"$f":"SUMIF(PigDetails!$H$15:$BE$15,Report!G$7,PigDetails!$H$67:$BE$67)","v":23456.199091395629},{"$f":"SUMIF(PigDetails!$H$15:$BE$15,Report!H$7,PigDetails!$H$67:$BE$67)","v":130881.59891070468},{"$f":"SUMIF(PigDetails!$H$15:$BE$15,Report!I$7,PigDetails!$H$67:$BE$67)","v":64092.398349789757},{"$f":"SUMIF(PigDetails!$H$15:$BE$15,Report!J$7,PigDetails!$H$67:$BE$67)","v":0},{"$f":"SUMIF(PigDetails!$H$15:$BE$15,Report!K$7,PigDetails!$H$67:$BE$67)","v":0},{"$f":"SUMIF(PigDetails!$H$15:$BE$15,Report!L$7,PigDetails!$H$67:$BE$67)","v":0},{"$f":"SUMIF(PigDetails!$H$15:$BE$15,Report!M$7,PigDetails!$H$67:$BE$67)","v":0},{"$f":"SUMIF(PigDetails!$H$15:$BE$15,Report!N$7,PigDetails!$H$67:$BE$67)","v":0},{"$f":"SUMIF(PigDetails!$H$15:$BE$15,Report!O$7,PigDetails!$H$67:$BE$67)","v":0},{"$f":"SUMIF(PigDetails!$H$15:$BE$15,Report!P$7,PigDetails!$H$67:$BE$67)","v":0},null,218430.19635189007]
[null,null,null,null,null,"MMS - Volatilisation N2O",{"$f":"SUMIF(PigDetails!$H$15:$BE$15,Report!G$7,PigDetails!$H$69:$BE$69)","v":48416.000688649932},{"$f":"SUMIF(PigDetails!$H$15:$BE$15,Report!H$7,PigDetails!$H$69:$BE$69)","v":29448.35975490855},{"$f":"SUMIF(PigDetails!$H$15:$BE$15,Report!I$7,PigDetails!$H$69:$BE$69)","v":132293.28377328397},{"$f":"SUMIF(PigDetails!$H$15:$BE$15,Report!J$7,PigDetails!$H$69:$BE$69)","v":0},{"$f":"SUMIF(PigDetails!$H$15:$BE$15,Report!K$7,PigDetails!$H$69:$BE$69)","v":0},{"$f":"SUMIF(PigDetails!$H$15:$BE$15,Report!L$7,PigDetails!$H$69:$BE$69)","v":0},{"$f":"SUMIF(PigDetails!$H$15:$BE$15,Report!M$7,PigDetails!$H$69:$BE$69)","v":0},{"$f":"SUMIF(PigDetails!$H$15:$BE$15,Report!N$7,PigDetails!$H$69:$BE$69)","v":0},{"$f":"SUMIF(PigDetails!$H$15:$BE$15,Report!O$7,PigDetails!$H$69:$BE$69)","v":0},{"$f":"SUMIF(PigDetails!$H$15:$BE$15,Report!P$7,PigDetails!$H$69:$BE$69)","v":0},null,210157.64421684245]
[null,null,null,null,null,"Soil - Leach & Runoff N2O & Vol ",{"$f":"SUMIF(PigDetails!$H$15:$BE$15,Report!G$7,PigDetails!$H$71:$BE$71)","v":8999.478247259658},{"$f":"SUMIF(PigDetails!$H$15:$BE$15,Report!H$7,PigDetails!$H$71:$BE$71)","v":4357.130228736678},{"$f":"SUMIF(PigDetails!$H$15:$BE$15,Report!I$7,PigDetails!$H$71:$BE$71)","v":24590.435241284209},{"$f":"SUMIF(PigDetails!$H$15:$BE$15,Report!J$7,PigDetails!$H$71:$BE$71)","v":0},{"$f":"SUMIF(PigDetails!$H$15:$BE$15,Report!K$7,PigDetails!$H$71:$BE$71)","v":0},{"$f":"SUMIF(PigDetails!$H$15:$BE$15,Report!L$7,PigDetails!$H$71:$BE$71)","v":0},{"$f":"SUMIF(PigDetails!$H$15:$BE$15,Report!M$7,PigDetails!$H$71:$BE$71)","v":0},{"$f":"SUMIF(PigDetails!$H$15:$BE$15,Report!N$7,PigDetails!$H$71:$BE$71)","v":0},{"$f":"SUMIF(PigDetails!$H$15:$BE$15,Report!O$7,PigDetails!$H$71:$BE$71)","v":0},{"$f":"SUMIF(PigDetails!$H$15:$BE$15,Report!P$7,PigDetails!$H$71:$BE$71)","v":0},null,37947.043717280547]
[null,null,null,null,null,"Soil - N20",{"$f":"SUMIF(PigDetails!$H$15:$BE$15,Report!G$7,PigDetails!$H$73:$BE$73)","v":71637.637789131608},{"$f":"SUMIF(PigDetails!$H$15:$BE$15,Report!H$7,PigDetails!$H$73:$BE$73)","v":34683.623711336732},{"$f":"SUMIF(PigDetails!$H$15:$BE$15,Report!I$7,PigDetails!$H$73:$BE$73)","v":195744.75813957583},{"$f":"SUMIF(PigDetails!$H$15:$BE$15,Report!J$7,PigDetails!$H$73:$BE$73)","v":0},{"$f":"SUMIF(PigDetails!$H$15:$BE$15,Report!K$7,PigDetails!$H$73:$BE$73)","v":0},{"$f":"SUMIF(PigDetails!$H$15:$BE$15,Report!L$7,PigDetails!$H$73:$BE$73)","v":0},{"$f":"SUMIF(PigDetails!$H$15:$BE$15,Report!M$7,PigDetails!$H$73:$BE$73)","v":0},{"$f":"SUMIF(PigDetails!$H$15:$BE$15,Report!N$7,PigDetails!$H$73:$BE$73)","v":0},{"$f":"SUMIF(PigDetails!$H$15:$BE$15,Report!O$7,PigDetails!$H$73:$BE$73)","v":0},{"$f":"SUMIF(PigDetails!$H$15:$BE$15,Report!P$7,PigDetails!$H$73:$BE$73)","v":0},null,302066.01964004419]
[]
[null,null,null,null,null,"Total MMS",{"$f":"SUM(G60:G66)","v":1118086.5078577613},{"$f":"SUM(H60:H66)","v":237292.98648633796},3321228.4740392719,0,0,0,0,0,0,0,null,{"$f":"SUM(R60:R66)","v":4676607.9683833718}]
[]
[null,null,null,null,null,"Offsets"]
[null,null,null,null,null,"Offsets",{"$f":"-OffSets!F31","v":0},{"$f":"-OffSets!G31","v":0},{"$f":"-OffSets!H31","v":0},{"$f":"-OffSets!I31","v":0},{"$f":"-OffSets!J31","v":0},{"$f":"-OffSets!K31","v":0},{"$f":"-OffSets!L31","v":0},{"$f":"-OffSets!M31","v":0},{"$f":"-OffSets!N31","v":0},{"$f":"-OffSets!O31","v":0},null,{"$f":"SUM(G70:P70)","v":0}]
[]
[null,null,null,null,"Total On Farm",null,{"$f":"G57+G67+G70","v":1458323.6428577614},{"$f":"H57+H67+H70","v":257014.90348633795},3335105.5490392721,0,0,0,0,0,0,0,null,5050444.0953833722]
[]
[null,null,null,"Post-Farm Estimate  (kg CO2-e)"]
[]
[null,null,null,null,null,"Pig Freight",{"$f":"G11*UserAssumotions!$H$39","v":1556.9267111111114},{"$f":"H11*UserAssumotions!$H$39","v":0},{"$f":"I11*UserAssumotions!$H$39","v":86936.319250000015},{"$f":"J11*UserAssumotions!$H$39","v":0},{"$f":"K11*UserAssumotions!$H$39","v":0},{"$f":"L11*UserAssumotions!$H$39","v":0},{"$f":"M11*UserAssumotions!$H$39","v":0},{"$f":"N11*UserAssumotions!$H$39","v":0},{"$f":"O11*UserAssumotions!$H$39","v":0},{"$f":"P11*UserAssumotions!$H$39","v":0},null,{"$f":"R11*UserAssumotions!$H$39","v":88493.245961111141}]
[null,null,null,null,null,"Meat Processing",{"$f":"G13*UserAssumotions!$H$41","v":22626.720000000001},{"$f":"H13*UserAssumotions!$H$41","v":0},{"$f":"I13*UserAssumotions!$H$41","v":528937.20000000007},{"$f":"J13*UserAssumotions!$H$41","v":0},{"$f":"K13*UserAssumotions!$H$41","v":0},{"$f":"L13*UserAssumotions!$H$41","v":0},{"$f":"M13*UserAssumotions!$H$41","v":0},{"$f":"N13*UserAssumotions!$H$41","v":0},{"$f":"O13*UserAssumotions!$H$41","v":0},{"$f":"P13*UserAssumotions!$H$41","v":0},null,{"$f":"R13*UserAssumotions!$H$41","v":551563.92000000004}]
[null,null,null,null,null,"Exported Manure",{"$f":"-SUMIF(PigDetails!$H$15:$BE$15,Report!G$7,PigDetails!$H$92:$BE$92)","v":0},{"$f":"-SUMIF(PigDetails!$H$15:$BE$15,Report!H$7,PigDetails!$H$92:$BE$92)","v":0},{"$f":"-SUMIF(PigDetails!$H$15:$BE$15,Report!I$7,PigDetails!$H$92:$BE$92)","v":0},{"$f":"-SUMIF(PigDetails!$H$15:$BE$15,Report!J$7,PigDetails!$H$92:$BE$92)","v":0},{"$f":"-SUMIF(PigDetails!$H$15:$BE$15,Report!K$7,PigDetails!$H$92:$BE$92)","v":0},{"$f":"-SUMIF(PigDetails!$H$15:$BE$15,Report!L$7,PigDetails!$H$92:$BE$92)","v":0},{"$f":"-SUMIF(PigDetails!$H$15:$BE$15,Report!M$7,PigDetails!$H$92:$BE$92)","v":0},{"$f":"-SUMIF(PigDetails!$H$15:$BE$15,Report!N$7,PigDetails!$H$92:$BE$92)","v":0},{"$f":"-SUMIF(PigDetails!$H$15:$BE$15,Report!O$7,PigDetails!$H$92:$BE$92)","v":0},{"$f":"-SUMIF(PigDetails!$H$15:$BE$15,Report!P$7,PigDetails!$H$92:$BE$92)","v":0},null,{"$f":"SUM(G78:P78)","v":0}]
[]
[null,null,null,null,"Total Post Farm",null,{"$f":"SUM(G76:G79)","v":24183.646711111112},{"$f":"SUM(H76:H79)","v":0},615873.51925000013,0,0,0,0,0,0,0,null,640057.1659611112]
[]
[null,null,null,"kg CO2-e / kg HSCW"]
[]
[null,null,null,null,null,"Pre-Farm",{"$f":"IF(G31<>0,G48/G31,\"\")","v":2.0056325733290317},0.95304742699063838,1.0425903305881341,"","","","","","","",null,{"$f":"IF(R31<>0,R48/R31,\"\")","v":1.1489890680159063}]
[]
[null,null,null,null,null,"On-Farm",{"$f":"IF(G31<>0,G72/G31,\"\")","v":8.3421062911021355},1.0634981369641536,3.4653124104072579,"","","","","","","",null,{"$f":"IF(R31<>0,R72/R31,\"\")","v":3.6626355802122603}]
[]
[null,null,null,null,null,"Post-Farm",{"$f":"IF(G31<>0,G80/G31,\"\")","v":0.13833866875751433},0,0.63991802301819378,"","","","","","","",null,{"$f":"IF(R31<>0,R80/R31,\"\")","v":0.46417623978095679}]
[]
[null,null,null,null,null,"kg CO2-e / kg HSCW",{"$f":"SUM(G84:G88)","v":10.486077533188682},{"$f":"SUM(H84:H88)","v":2.016545563954792},5.147820764013586,0,0,0,0,0,0,0,null,5.2758008880091234]
[]
[null,null,null,{"$f":"TEXT(NOW(),\"d mmmm yyyy\")& \"  -  \"&Menu!$A$1","v":"13 May 2014  -  Pork Industry Greenhouse Gas Calculator     Version 1.02.04"}]

{"sheet":"PigMovements","index":6,"n_rows":262,"n_cols":46,"rows_kept":262,"cut":false,"hidden":false,"merged":[[2,10,5,22]]}
["Calc",false]
["Monthly",false]
["Year",true,null,null,null,null,null,null,null,null,"Pig Movements"]
[]
[]
[]
[]
[null,null,null,null,null,"SALES"]
[null,null,null,null,null,null,1,2,3,4,5,6,7,8,9,10,11,12,13,14,15,16,17,18,19,20,21,22,23,24,25,26,27,28,29,30,31,32,33,34,35,36,37,38,39,40]
[null,null,null,null,null,"Unit","Breeder","Breeder","GrowOut","Breeder","Weaner"]
[null,null,null,null,null,"Pig Type","Gest Sows","Boars","Finishers","Suckers","Growers"]
[{"$f":"IF($B$1=TRUE,\"\",\"*\")","v":"*"},null,null,null,null,"No per week"]
[{"$f":"A12","v":"*"},null,null,null,null,"Live Wt. kg/hd"]
[{"$f":"A13","v":"*"},null,null,null,null,"Dress% (Trim 1)"]
["*",null,null,null,null,"Dress Wt. kg/hd",{"$f":"G13*G14","v":0},0,0,{"$f":"J13*J14","v":0},0,{"$f":"L13*L14","v":0},{"$f":"M13*M14","v":0},{"$f":"N13*N14","v":0},{"$f":"O13*O14","v":0},0,0,0,0,0,0,0,0,0,0,0,0,0,0,0,0,0,0,0,0,0,0,0,0,0,0,0,0,0,0,0]
["*",null,null,null,null,"Live Wt./week",{"$f":"G12*G13","v":0},0,0,{"$f":"J12*J13","v":0},0,{"$f":"L12*L13","v":0},{"$f":"M12*M13","v":0},{"$f":"N12*N13","v":0},{"$f":"O12*O13","v":0},0,0,0,0,0,0,0,0,0,0,0,0,0,0,0,0,0,0,0,0,0,0,0,0,0,0,0,0,0,0,0]
["*",null,null,null,null,"D. Wt/week",{"$f":"G15*G12","v":0},0,0,{"$f":"J15*J12","v":0},0,{"$f":"L15*L12","v":0},{"$f":"M15*M12","v":0},{"$f":"N15*N12","v":0},{"$f":"O15*O12","v":0},0,0,0,0,0,0,0,0,0,0,0,0,0,0,0,0,0,0,0,0,0,0,0,0,0,0,0,0,0,0,0]
["*",null,null,null,null,"Sales/yr",{"$f":"G12/7*365.25","v":0},0,0,{"$f":"J12/7*365.25","v":0},0,{"$f":"L12/7*365.25","v":0},{"$f":"M12/7*365.25","v":0},{"$f":"N12/7*365.25","v":0},{"$f":"O12/7*365.25","v":0},0,0,0,0,0,0,0,0,0,0,0,0,0,0,0,0,0,0,0,0,0,0,0,0,0,0,0,0,0,0,0]
["*",null,null,null,null,"Live Wt./yr",{"$f":"G18*G13","v":0},0,0,{"$f":"J18*J13","v":0},0,{"$f":"L18*L13","v":0},{"$f":"M18*M13","v":0},{"$f":"N18*N13","v":0},{"$f":"O18*O13","v":0},0,0,0,0,0,0,0,0,0,0,0,0,0,0,0,0,0,0,0,0,0,0,0,0,0,0,0,0,0,0,0]
["*",null,null,null,null,"D. Wt/yr",{"$f":"G18*G15","v":0},0,0,{"$f":"J18*J15","v":0},0,{"$f":"L18*L15","v":0},{"$f":"M18*M15","v":0},{"$f":"N18*N15","v":0},{"$f":"O18*O15","v":0},0,0,0,0,0,0,0,0,0,0,0,0,0,0,0,0,0,0,0,0,0,0,0,0,0,0,0,0,0,0,0]
["*"]
["*"]
[{"$f":"IF($B$2=TRUE,\"\",\"*\")","v":"*"},null,null,null,null,"January"]
[{"$f":"A23","v":"*"},null,null,null,null,"Number Sold"]
[{"$f":"A24","v":"*"},null,null,null,null,"Total Live Wt. kg"]
["*",null,null,null,null,"Total Dress Wt. kg"]
["*",null,null,null,null,"February"]
["*",null,null,null,null,"Number Sold"]
["*",null,null,null,null,"Total Live Wt. kg"]
["*",null,null,null,null,"Total Dress Wt. kg"]
["*",null,null,null,null,"March"]
["*",null,null,null,null,"Number Sold"]
["*",null,null,null,null,"Total Live Wt. kg"]
["*",null,null,null,null,"Total Dress Wt. kg"]
["*",null,null,null,null,"April"]
["*",null,null,null,null,"Number Sold"]
["*",null,null,null,null,"Total Live Wt. kg"]
["*",null,null,null,null,"Total Dress Wt. kg"]
["*",null,null,null,null,"May"]
["*",null,null,null,null,"Number Sold"]
["*",null,null,null,null,"Total Live Wt. kg"]
["*",null,null,null,null,"Total Dress Wt. kg"]
["*",null,null,null,null,"June"]
["*",null,null,null,null,"Number Sold"]
["*",null,null,null,null,"Total Live Wt. kg"]
["*",null,null,null,null,"Total Dress Wt. kg"]
["*",null,null,null,null,"July"]
["*",null,null,null,null,"Number Sold"]
["*",null,null,null,null,"Total Live Wt. kg"]
["*",null,null,null,null,"Total Dress Wt. kg"]
["*",null,null,null,null,"August"]
["*",null,null,null,null,"Number Sold"]
["*",null,null,null,null,"Total Live Wt. kg"]
["*",null,null,null,null,"Total Dress Wt. kg"]
["*",null,null,null,null,"September"]
["*",null,null,null,null,"Number Sold"]
["*",null,null,null,null,"Total Live Wt. kg"]
["*",null,null,null,null,"Total Dress Wt. kg"]
["*",null,null,null,null,"October"]
["*",null,null,null,null,"Number Sold"]
["*",null,null,null,null,"Total Live Wt. kg"]
["*",null,null,null,null,"Total Dress Wt. kg"]
["*",null,null,null,null,"November"]
["*",null,null,null,null,"Number Sold"]
["*",null,null,null,null,"Total Live Wt. kg"]
["*",null,null,null,null,"Total Dress Wt. kg"]
["*",null,null,null,null,"December"]
["*",null,null,null,null,"Number Sold"]
["*",null,null,null,null,"Total Live Wt. kg"]
["*",null,null,null,null,"Total Dress Wt. kg"]
["*"]
["*",null,null,null,null,"Annual Sales",{"$f":"G24+G28+G32+G36+G40+G44+G48+G52+G56+G60+G64+G68","v":0},0,0,0,0,{"$f":"L24+L28+L32+L36+L40+L44+L48+L52+L56+L60+L64+L68","v":0},{"$f":"M24+M28+M32+M36+M40+M44+M48+M52+M56+M60+M64+M68","v":0},{"$f":"N24+N28+N32+N36+N40+N44+N48+N52+N56+N60+N64+N68","v":0},{"$f":"O24+O28+O32+O36+O40+O44+O48+O52+O56+O60+O64+O68","v":0},0,0,0,0,0,0,0,0,0,0,0,0,0,0,0,0,0,0,0,0,0,0,0,0,0,0,0,0,0,0,0]
["*",null,null,null,null,"Annual L.WT",{"$f":"G25+G29+G33+G37+G41+G45+G49+G53+G57+G61+G65+G69","v":0},0,0,0,0,{"$f":"L25+L29+L33+L37+L41+L45+L49+L53+L57+L61+L65+L69","v":0},0,0,{"$f":"O25+O29+O33+O37+O41+O45+O49+O53+O57+O61+O65+O69","v":0},0,0,0,0,0,0,0,0,0,0,0,0,0,0,0,0,0,0,0,0,0,0,0,0,0,0,0,0,0,0,0]
["*",null,null,null,null,"Annual D.WT",{"$f":"G26+G30+G34+G38+G42+G46+G50+G54+G58+G62+G66+G70","v":0},0,0,0,0,0,0,0,{"$f":"O26+O30+O34+O38+O42+O46+O50+O54+O58+O62+O66+O70","v":0},0,0,0,0,0,0,0,0,0,0,0,0,0,0,0,0,0,0,0,0,0,0,0,0,0,0,0,0,0,0,0]
["*",null,null,null,null,"Dress % (Trim 1)",{"$f":"IF(G73<>0,G74/G73,\"\")","v":""},"","","","",{"$f":"IF(L73<>0,L74/L73,\"\")","v":""},"","","","","","","","","","","","","","","","","","","","","","","","","","","","","","","","","",""]
["*"]
["*"]
["*"]
[{"$f":"IF($B$3=TRUE,\"\",\"*\")","v":""},null,null,null,null,"Total Sales",310,18,18315]
[{"$f":"A79","v":""},null,null,null,null,"Live Wt./yr kg",{"$f":"G79*225","v":69750},4680,{"$f":"I79*95","v":1739925}]
[{"$f":"A80","v":""},null,null,null,null,"D. Wt/yr kg",{"$f":"G80*0.76","v":53010},{"$f":"H80*0.76","v":3556.8},{"$f":"I80*0.76","v":1322343}]
[{"$f":"A81","v":""},null,null,null,null,"Dress % (Trim 1)",{"$f":"IF(G80<>0,G81/G80,\"\")","v":0.76},{"$f":"IF(H80<>0,H81/H80,\"\")","v":0.76},0.76,"","","","","",{"$f":"IF(O80<>0,O81/O80,\"\")","v":""},"","","","","","","","","","","","","","","","","","","","","","","","","","","","","","",""]
[]
["*"]
["*"]
["*",null,null,null,null,"Annual Sales",{"$f":"IF($B$1=TRUE,G18,IF($B$2=TRUE,G72,G79))","v":310},{"$f":"IF($B$1=TRUE,H18,IF($B$2=TRUE,H72,H79))","v":18},18315,0,0,0,0,0,{"$f":"IF($B$1=TRUE,O18,IF($B$2=TRUE,O72,O79))","v":0},0,0,0,0,0,0,0,0,0,0,0,0,0,0,0,0,0,0,0,0,0,0,0,0,0,0,0,0,0,0,0]
["*",null,null,null,null,"Annual L.WT",{"$f":"IF($B$1=TRUE,G19,IF($B$2=TRUE,G73,G80))","v":69750},4680,1739925,0,0,0,0,0,{"$f":"IF($B$1=TRUE,O19,IF($B$2=TRUE,O73,O80))","v":0},0,0,0,0,0,0,0,0,0,0,0,0,0,0,0,0,0,0,0,0,0,0,0,0,0,0,0,0,0,0,0]
["*",null,null,null,null,"Annual D.WT",53010,3556.8,1322343,0,0,0,0,0,{"$f":"IF($B$1=TRUE,O20,IF($B$2=TRUE,O74,O81))","v":0},0,0,0,0,0,0,0,0,0,0,0,0,0,0,0,0,0,0,0,0,0,0,0,0,0,0,0,0,0,0,0]
["*",null,null,null,null,"Weekly Sales",{"$f":"G86/365.25*7","v":5.9411362080766592},{"$f":"H86/365.25*7","v":0.34496919917864477},351.00616016427102,0,0,0,0,0,{"$f":"O86/365.25*7","v":0},0,0,0,0,0,0,0,0,0,0,0,0,0,0,0,0,0,0,0,0,0,0,0,0,0,0,0,0,0,0,0]
["*",null,null,null,null,"Dress % (Trim 1)",{"$f":"IF(G87<>0,G88/G87,\"\")","v":0.76},{"$f":"IF(H87<>0,H88/H87,\"\")","v":0.76},0.76,"","","","","",{"$f":"IF(O87<>0,O88/O87,\"\")","v":""},"","","","","","","","","","","","","","","","","","","","","","","","","","","","","","",""]
["*",null,null,null,null,"Av. L.wt",{"$f":"IF(G86<>0,G87/G86,\"\")","v":225},{"$f":"IF(H86<>0,H87/H86,\"\")","v":260},95,"","","","","","","","","","","","","","","","","","","","","","","","","","","","","","","","","","","","",""]
["*",null,null,null,null,"Av. D. Wt",{"$f":"IF(G86<>0,G88/G86,\"\")","v":171},{"$f":"IF(H86<>0,H88/H86,\"\")","v":197.60000000000002},72.2,"","","","","","","","","","","","","","","","","","","","","","","","","","","","","","","","","","","","",""]
[]
[null,null,null,null,null,"TRANSFERS"]
[]
[null,null,null,null,null,"Transfer to",null,null,null,"Weaner","GrowOut"]
[{"$f":"IF($B$1=TRUE,\"\",\"*\")","v":"*"},null,null,null,null,"No Transfers/week"]
[{"$f":"A97","v":"*"},null,null,null,null,"Live Wt. kg/hd"]
[{"$f":"A98","v":"*"},null,null,null,null,"Dress% (Trim 1)",{"$f":"IF(G98<>0,DrPercent,0)","v":0},0,0,0,0,0,0,0,0,0,0,0,0,0,0,0,0,0,0,0,0,0,0,0,0,0,0,0,0,0,0,0,0,0,0,0,0,0,0,0]
["*",null,null,null,null,"Dress Wt. kg/hd",{"$f":"IF(G98<>\"\",G98*G99,0)","v":0},{"$f":"IF(H98<>\"\",H98*H99,0)","v":0},{"$f":"IF(I98<>\"\",I98*I99,0)","v":0},{"$f":"IF(J98<>\"\",J98*J99,0)","v":0},{"$f":"IF(K98<>\"\",K98*K99,0)","v":0},{"$f":"IF(L98<>\"\",L98*L99,0)","v":0},{"$f":"IF(M98<>\"\",M98*M99,0)","v":0},{"$f":"IF(N98<>\"\",N98*N99,0)","v":0},{"$f":"IF(O98<>\"\",O98*O99,0)","v":0},{"$f":"IF(P98<>\"\",P98*P99,0)","v":0},{"$f":"IF(Q98<>\"\",Q98*Q99,0)","v":0},{"$f":"IF(R98<>\"\",R98*R99,0)","v":0},{"$f":"IF(S98<>\"\",S98*S99,0)","v":0},{"$f":"IF(T98<>\"\",T98*T99,0)","v":0},{"$f":"IF(U98<>\"\",U98*U99,0)","v":0},{"$f":"IF(V98<>\"\",V98*V99,0)","v":0},{"$f":"IF(W98<>\"\",W98*W99,0)","v":0},{"$f":"IF(X98<>\"\",X98*X99,0)","v":0},{"$f":"IF(Y98<>\"\",Y98*Y99,0)","v":0},{"$f":"IF(Z98<>\"\",Z98*Z99,0)","v":0},{"$f":"IF(AA98<>\"\",AA98*AA99,0)","v":0},{"$f":"IF(AB98<>\"\",AB98*AB99,0)","v":0},{"$f":"IF(AC98<>\"\",AC98*AC99,0)","v":0},{"$f":"IF(AD98<>\"\",AD98*AD99,0)","v":0},{"$f":"IF(AE98<>\"\",AE98*AE99,0)","v":0},{"$f":"IF(AF98<>\"\",AF98*AF99,0)","v":0},{"$f":"IF(AG98<>\"\",AG98*AG99,0)","v":0},{"$f":"IF(AH98<>\"\",AH98*AH99,0)","v":0},{"$f":"IF(AI98<>\"\",AI98*AI99,0)","v":0},{"$f":"IF(AJ98<>\"\",AJ98*AJ99,0)","v":0},{"$f":"IF(AK98<>\"\",AK98*AK99,0)","v":0},{"$f":"IF(AL98<>\"\",AL98*AL99,0)","v":0},{"$f":"IF(AM98<>\"\",AM98*AM99,0)","v":0},{"$f":"IF(AN98<>\"\",AN98*AN99,0)","v":0},{"$f":"IF(AO98<>\"\",AO98*AO99,0)","v":0},{"$f":"IF(AP98<>\"\",AP98*AP99,0)","v":0},{"$f":"IF(AQ98<>\"\",AQ98*AQ99,0)","v":0},{"$f":"IF(AR98<>\"\",AR98*AR99,0)","v":0},{"$f":"IF(AS98<>\"\",AS98*AS99,0)","v":0},{"$f":"IF(AT98<>\"\",AT98*AT99,0)","v":0}]
["*",null,null,null,null,"Live Wt./week",{"$f":"G98*G97","v":0},{"$f":"H98*H97","v":0},0,0,0,0,0,0,0,0,0,0,0,0,0,0,0,0,0,0,0,0,0,0,0,0,0,0,0,0,0,0,0,0,0,0,0,0,0,0]
["*",null,null,null,null,"D. Wt/week",{"$f":"G100*G97","v":0},{"$f":"H100*H97","v":0},0,0,0,0,0,0,0,0,0,0,0,0,0,0,0,0,0,0,0,0,0,0,0,0,0,0,0,0,0,0,0,0,0,0,0,0,0,0]
["*",null,null,null,null,"Transfer pigs/yr",{"$f":"G97/7*365.25","v":0},{"$f":"H97/7*365.25","v":0},0,0,0,0,0,0,0,0,0,0,0,0,0,0,0,0,0,0,0,0,0,0,0,0,0,0,0,0,0,0,0,0,0,0,0,0,0,0]
["*",null,null,null,null,"Live Wt./yr",{"$f":"G103*G98","v":0},{"$f":"H103*H98","v":0},0,0,0,0,0,0,0,0,0,0,0,0,0,0,0,0,0,0,0,0,0,0,0,0,0,0,0,0,0,0,0,0,0,0,0,0,0,0]
["*",null,null,null,null,"D. Wt/yr",{"$f":"G103*G100","v":0},{"$f":"H103*H100","v":0},0,0,0,0,0,0,0,0,0,0,0,0,0,0,0,0,0,0,0,0,0,0,0,0,0,0,0,0,0,0,0,0,0,0,0,0,0,0]
["*"]
["*"]
[{"$f":"IF($B$2=TRUE,\"\",\"*\")","v":"*"},null,null,null,null,"January"]
[{"$f":"A108","v":"*"},null,null,null,null,"Number Transferred"]
[{"$f":"A109","v":"*"},null,null,null,null,"Total Live Wt. kg"]
["*",null,null,null,null,"Total Dress Wt. kg",{"$f":"G110*DrPercent","v":0},0,0,0,0,0,0,0,0,0,0,0,0,0,0,0,0,0,0,0,0,0,0,0,0,0,0,0,0,0,0,0,0,0,0,0,0,0,0,0]
["*",null,null,null,null,"February"]
["*",null,null,null,null,"Number Transferred"]
["*",null,null,null,null,"Total Live Wt. kg"]
["*",null,null,null,null,"Total Dress Wt. kg",{"$f":"G114*DrPercent","v":0},0,0,0,0,0,0,0,0,0,0,0,0,0,0,0,0,0,0,0,0,0,0,0,0,0,0,0,0,0,0,0,0,0,0,0,0,0,0,0]
["*",null,null,null,null,"March"]
["*",null,null,null,null,"Number Transferred"]
["*",null,null,null,null,"Total Live Wt. kg"]
["*",null,null,null,null,"Total Dress Wt. kg",{"$f":"G118*DrPercent","v":0},0,0,0,0,0,0,0,0,0,0,0,0,0,0,0,0,0,0,0,0,0,0,0,0,0,0,0,0,0,0,0,0,0,0,0,0,0,0,0]
["*",null,null,null,null,"April"]
["*",null,null,null,null,"Number Transferred"]
["*",null,null,null,null,"Total Live Wt. kg"]
["*",null,null,null,null,"Total Dress Wt. kg",{"$f":"G122*DrPercent","v":0},0,0,0,0,0,0,0,0,0,0,0,0,0,0,0,0,0,0,0,0,0,0,0,0,0,0,0,0,0,0,0,0,0,0,0,0,0,0,0]
["*",null,null,null,null,"May"]
["*",null,null,null,null,"Number Transferred"]
["*",null,null,null,null,"Total Live Wt. kg"]
["*",null,null,null,null,"Total Dress Wt. kg",{"$f":"G126*DrPercent","v":0},0,0,0,0,0,0,0,0,0,0,0,0,0,0,0,0,0,0,0,0,0,0,0,0,0,0,0,0,0,0,0,0,0,0,0,0,0,0,0]
["*",null,null,null,null,"June"]
["*",null,null,null,null,"Number Transferred"]
["*",null,null,null,null,"Total Live Wt. kg"]
["*",null,null,null,null,"Total Dress Wt. kg",{"$f":"G130*DrPercent","v":0},0,0,0,0,0,0,0,0,0,0,0,0,0,0,0,0,0,0,0,0,0,0,0,0,0,0,0,0,0,0,0,0,0,0,0,0,0,0,0]
["*",null,null,null,null,"July"]
["*",null,null,null,null,"Number Transferred"]
["*",null,null,null,null,"Total Live Wt. kg"]
["*",null,null,null,null,"Total Dress Wt. kg",{"$f":"G134*DrPercent","v":0},0,0,0,0,0,0,0,0,0,0,0,0,0,0,0,0,0,0,0,0,0,0,0,0,0,0,0,0,0,0,0,0,0,0,0,0,0,0,0]
["*",null,null,null,null,"August"]
["*",null,null,null,null,"Number Transferred"]
["*",null,null,null,null,"Total Live Wt. kg"]
["*",null,null,null,null,"Total Dress Wt. kg",{"$f":"G138*DrPercent","v":0},0,0,0,0,0,0,0,0,0,0,0,0,0,0,0,0,0,0,0,0,0,0,0,0,0,0,0,0,0,0,0,0,0,0,0,0,0,0,0]
["*",null,null,null,null,"September"]
["*",null,null,null,null,"Number Transferred"]
["*",null,null,null,null,"Total Live Wt. kg"]
["*",null,null,null,null,"Total Dress Wt. kg",{"$f":"G142*DrPercent","v":0},0,0,0,0,0,0,0,0,0,0,0,0,0,0,0,0,0,0,0,0,0,0,0,0,0,0,0,0,0,0,0,0,0,0,0,0,0,0,0]
["*",null,null,null,null,"October"]
["*",null,null,null,null,"Number Transferred"]
["*",null,null,null,null,"Total Live Wt. kg"]
["*",null,null,null,null,"Total Dress Wt. kg",{"$f":"G146*DrPercent","v":0},0,0,0,0,0,0,0,0,0,0,0,0,0,0,0,0,0,0,0,0,0,0,0,0,0,0,0,0,0,0,0,0,0,0,0,0,0,0,0]
["*",null,null,null,null,"November"]
["*",null,null,null,null,"Number Transferred"]
["*",null,null,null,null,"Total Live Wt. kg"]
["*",null,null,null,null,"Total Dress Wt. kg",{"$f":"G150*DrPercent","v":0},0,0,0,0,0,0,0,0,0,0,0,0,0,0,0,0,0,0,0,0,0,0,0,0,0,0,0,0,0,0,0,0,0,0,0,0,0,0,0]
["*",null,null,null,null,"December"]
["*",null,null,null,null,"Number Transferred"]
["*",null,null,null,null,"Total Live Wt. kg"]
["*",null,null,null,null,"Total Dress Wt. kg",{"$f":"G154*DrPercent","v":0},0,0,0,0,0,0,0,0,0,0,0,0,0,0,0,0,0,0,0,0,0,0,0,0,0,0,0,0,0,0,0,0,0,0,0,0,0,0,0]
["*"]
["*",null,null,null,null,"Annual Transfers",{"$f":"G109+G113+G117+G121+G125+G129+G133+G137+G141+G145+G149+G153","v":0},{"$f":"H109+H113+H117+H121+H125+H129+H133+H137+H141+H145+H149+H153","v":0},0,0,0,0,0,0,0,0,0,0,0,0,0,0,0,0,0,0,0,0,0,0,0,0,0,0,0,0,0,0,0,0,0,0,0,0,0,0]
["*",null,null,null,null,"Annual L.WT",{"$f":"G110+G114+G118+G122+G126+G130+G134+G138+G142+G146+G150+G154","v":0},0,0,0,0,0,0,0,0,0,0,0,0,0,0,0,0,0,0,0,0,0,0,0,0,0,0,0,0,0,0,0,0,0,0,0,0,0,0,0]
["*",null,null,null,null,"Annual D.WT",0,0,0,0,0,0,0,0,0,0,0,0,0,0,0,0,0,0,0,0,0,0,0,0,0,0,0,0,0,0,0,0,0,0,0,0,0,0,0,0]
["*",null,null,null,null,"Dress % (Trim 1)",{"$f":"IF(G158<>0,G159/G158,\"\")","v":""},{"$f":"IF(H158<>0,H159/H158,\"\")","v":""},"","","","","","","","","","","","","","","","","","","","","","","","","","","","","","","","","","","","","",""]
["*"]
["*"]
["*"]
[{"$f":"IF($B$3=TRUE,\"\",\"*\")","v":""},null,null,null,null,"Total Transfers",null,null,null,{"$f":"K164+507","v":19500},{"$f":"18315+336+342","v":18993}]
[{"$f":"A164","v":""},null,null,null,null,"Live Wt./yr kg",null,null,null,{"$f":"J164*8","v":156000},{"$f":"K164*25","v":474825}]
[{"$f":"A165","v":""},null,null,null,null,"D. Wt/yr kg",{"$f":"IF(G165<>0,G165*G167,\"\")","v":""},"","",118248,359917.35,"",{"$f":"IF(M165<>0,M165*M167,\"\")","v":""},{"$f":"IF(N165<>0,N165*N167,\"\")","v":""},"","","","","","","","","","","","","","","","","","","","","","","","","","","","","","","",""]
[{"$f":"A166","v":""},null,null,null,null,"Dress % (Trim 1)",{"$f":"IF(G165<>0,DrPercent,0)","v":0},0,0,0.75800000000000001,0.75800000000000001,0,0,0,0,0,0,0,0,0,0,0,0,0,0,0,0,0,0,0,0,0,0,0,0,0,0,0,0,0,0,0,0,0,0,0]
[]
["*"]
["*"]
["*",null,null,null,null,"Annual Transfers",{"$f":"IF($B$1=TRUE,G103,IF($B$2=TRUE,G157,G164))","v":0},{"$f":"IF($B$1=TRUE,H103,IF($B$2=TRUE,H157,H164))","v":0},0,19500,18993,0,0,0,0,0,0,0,0,0,0,0,0,0,0,0,0,0,0,0,0,0,0,0,0,0,0,0,0,0,0,0,0,0,0,0]
["*",null,null,null,null,"Annual L.WT",{"$f":"IF($B$1=TRUE,G104,IF($B$2=TRUE,G158,G165))","v":0},0,0,156000,474825,0,0,0,0,0,0,0,0,0,0,0,0,0,0,0,0,0,0,0,0,0,0,0,0,0,0,0,0,0,0,0,0,0,0,0]
["*",null,null,null,null,"Annual D.WT",{"$f":"IF($B$1=TRUE,G105,IF($B$2=TRUE,G159,G166))","v":""},"","",118248,359917.35,"","","","","","","","","","","","","","","","","","","","","","","","","","","","","","","","","","",""]
["*",null,null,null,null,"Weekly Transfers",{"$f":"G171/365.25*7","v":0},{"$f":"H171/365.25*7","v":0},0,373.71663244353181,364,0,0,0,0,0,0,0,0,0,0,0,0,0,0,0,0,0,0,0,0,0,0,0,0,0,0,0,0,0,0,0,0,0,0,0]
["*",null,null,null,null,"Dress % (Trim 1)",{"$f":"IF(G172<>0,G173/G172,\"\")","v":""},{"$f":"IF(H172<>0,H173/H172,\"\")","v":""},"",0.75800000000000001,0.7579999999999999,"","","","","","","","","","","","","","","","","","","","","","","","","","","","","","","","","","",""]
["*",null,null,null,null,"Av. L.wt",{"$f":"IF(G171<>0,G172/G171,\"\")","v":""},{"$f":"IF(H171<>0,H172/H171,\"\")","v":""},"",8,25,"","","","","","","","","","","","","","","","","","","","","","","","","","","","","","","","","","",""]
["*",null,null,null,null,"Av. D. Wt",{"$f":"IF(G171<>0,G173/G171,\"\")","v":""},{"$f":"IF(H171<>0,H173/H171,\"\")","v":""},"",6.0640000000000001,18.95,"","","","","","","","","","","","","","","","","","","","","","","","","","","","","","","","","","",""]
["*"]
["*"]
[null,null,null,null,null,"PURCHASES"]
[]
[{"$f":"IF($B$1=TRUE,\"\",\"*\")","v":"*"},null,null,null,null,"No Purchases/week"]
[{"$f":"A182","v":"*"},null,null,null,null,"Live Wt. kg/hd"]
[{"$f":"A183","v":"*"},null,null,null,null,"Dress% (Trim 1)",{"$f":"IF(G183<>0,DrPercent,\"\")","v":""},"","","","","","","","","","","","","","","","","","","","","","","","","","","","","","","","","","","","","","",""]
["*",null,null,null,null,"Dress Wt. kg/hd",{"$f":"IF(G184<>\"\",G183*G184,0)","v":0},{"$f":"IF(H184<>\"\",H183*H184,0)","v":0},0,0,0,0,0,0,0,0,0,0,0,0,0,0,0,0,0,0,0,0,0,0,0,0,0,0,0,0,0,0,0,0,0,0,0,0,0,0]
["*",null,null,null,null,"Live Wt./week",{"$f":"G182*G183","v":0},{"$f":"H182*H183","v":0},0,0,0,0,0,0,0,0,0,0,0,0,0,0,0,0,0,0,0,0,0,0,0,0,0,0,0,0,0,0,0,0,0,0,0,0,0,0]
["*",null,null,null,null,"D. Wt/week",{"$f":"G185*G182","v":0},{"$f":"H185*H182","v":0},0,0,0,0,0,0,0,0,0,0,0,0,0,0,0,0,0,0,0,0,0,0,0,0,0,0,0,0,0,0,0,0,0,0,0,0,0,0]
["*",null,null,null,null,"Purchase pigs/yr",{"$f":"G182/7*365.25","v":0},{"$f":"H182/7*365.25","v":0},0,0,0,0,0,0,0,0,0,0,0,0,0,0,0,0,0,0,0,0,0,0,0,0,0,0,0,0,0,0,0,0,0,0,0,0,0,0]
["*",null,null,null,null,"Live Wt./yr",{"$f":"G188*G183","v":0},{"$f":"H188*H183","v":0},0,0,0,0,0,0,0,0,0,0,0,0,0,0,0,0,0,0,0,0,0,0,0,0,0,0,0,0,0,0,0,0,0,0,0,0,0,0]
["*",null,null,null,null,"D. Wt/yr",{"$f":"G188*G185","v":0},{"$f":"H188*H185","v":0},0,0,0,0,0,0,0,0,0,0,0,0,0,0,0,0,0,0,0,0,0,0,0,0,0,0,0,0,0,0,0,0,0,0,0,0,0,0]
["*"]
["*"]
[{"$f":"IF($B$2=TRUE,\"\",\"*\")","v":"*"},null,null,null,null,"January"]
[{"$f":"A193","v":"*"},null,null,null,null,"Number Purchased"]
[{"$f":"A194","v":"*"},null,null,null,null,"Total Live Wt. kg"]
["*",null,null,null,null,"Total Dress Wt. kg",{"$f":"IF(G195<>0,G195*DrPercent,0)","v":0},0,0,0,0,0,0,0,0,0,0,0,0,0,0,0,0,0,0,0,0,0,0,0,0,0,0,0,0,0,0,0,0,0,0,0,0,0,0,0]
["*",null,null,null,null,"February"]
["*",null,null,null,null,"Number Purchased"]
["*",null,null,null,null,"Total Live Wt. kg"]
["*",null,null,null,null,"Total Dress Wt. kg",{"$f":"IF(G199<>0,G199*DrPercent,0)","v":0},0,0,0,0,0,0,0,0,0,0,0,0,0,0,0,0,0,0,0,0,0,0,0,0,0,0,0,0,0,0,0,0,0,0,0,0,0,0,0]
["*",null,null,null,null,"March"]
["*",null,null,null,null,"Number Purchased"]
["*",null,null,null,null,"Total Live Wt. kg"]
["*",null,null,null,null,"Total Dress Wt. kg",{"$f":"IF(G203<>0,G203*DrPercent,0)","v":0},0,0,0,0,0,0,0,0,0,0,0,0,0,0,0,0,0,0,0,0,0,0,0,0,0,0,0,0,0,0,0,0,0,0,0,0,0,0,0]
["*",null,null,null,null,"April"]
["*",null,null,null,null,"Number Purchased"]
["*",null,null,null,null,"Total Live Wt. kg"]
["*",null,null,null,null,"Total Dress Wt. kg",{"$f":"IF(G207<>0,G207*DrPercent,0)","v":0},0,0,0,0,0,0,0,0,0,0,0,0,0,0,0,0,0,0,0,0,0,0,0,0,0,0,0,0,0,0,0,0,0,0,0,0,0,0,0]
["*",null,null,null,null,"May"]
["*",null,null,null,null,"Number Purchased"]
["*",null,null,null,null,"Total Live Wt. kg"]
["*",null,null,null,null,"Total Dress Wt. kg",{"$f":"IF(G211<>0,G211*DrPercent,0)","v":0},0,0,0,0,0,0,0,0,0,0,0,0,0,0,0,0,0,0,0,0,0,0,0,0,0,0,0,0,0,0,0,0,0,0,0,0,0,0,0]
["*",null,null,null,null,"June"]
["*",null,null,null,null,"Number Purchased"]
["*",null,null,null,null,"Total Live Wt. kg"]
["*",null,null,null,null,"Total Dress Wt. kg",{"$f":"IF(G215<>0,G215*DrPercent,0)","v":0},0,0,0,0,0,0,0,0,0,0,0,0,0,0,0,0,0,0,0,0,0,0,0,0,0,0,0,0,0,0,0,0,0,0,0,0,0,0,0]
["*",null,null,null,null,"July"]
["*",null,null,null,null,"Number Purchased"]
["*",null,null,null,null,"Total Live Wt. kg"]
["*",null,null,null,null,"Total Dress Wt. kg",{"$f":"IF(G219<>0,G219*DrPercent,0)","v":0},0,0,0,0,0,0,0,0,0,0,0,0,0,0,0,0,0,0,0,0,0,0,0,0,0,0,0,0,0,0,0,0,0,0,0,0,0,0,0]
["*",null,null,null,null,"August"]
["*",null,null,null,null,"Number Purchased"]
["*",null,null,null,null,"Total Live Wt. kg"]
["*",null,null,null,null,"Total Dress Wt. kg",{"$f":"IF(G223<>0,G223*DrPercent,0)","v":0},0,0,0,0,0,0,0,0,0,0,0,0,0,0,0,0,0,0,0,0,0,0,0,0,0,0,0,0,0,0,0,0,0,0,0,0,0,0,0]
["*",null,null,null,null,"September"]
["*",null,null,null,null,"Number Purchased"]
["*",null,null,null,null,"Total Live Wt. kg"]
["*",null,null,null,null,"Total Dress Wt. kg",{"$f":"IF(G227<>0,G227*DrPercent,0)","v":0},0,0,0,0,0,0,0,0,0,0,0,0,0,0,0,0,0,0,0,0,0,0,0,0,0,0,0,0,0,0,0,0,0,0,0,0,0,0,0]
["*",null,null,null,null,"October"]
["*",null,null,null,null,"Number Purchased"]
["*",null,null,null,null,"Total Live Wt. kg"]
["*",null,null,null,null,"Total Dress Wt. kg",{"$f":"IF(G231<>0,G231*DrPercent,0)","v":0},0,0,0,0,0,0,0,0,0,0,0,0,0,0,0,0,0,0,0,0,0,0,0,0,0,0,0,0,0,0,0,0,0,0,0,0,0,0,0]
["*",null,null,null,null,"November"]
["*",null,null,null,null,"Number Purchased"]
["*",null,null,null,null,"Total Live Wt. kg"]
["*",null,null,null,null,"Total Dress Wt. kg",{"$f":"IF(G235<>0,G235*DrPercent,0)","v":0},0,0,0,0,0,0,0,0,0,0,0,0,0,0,0,0,0,0,0,0,0,0,0,0,0,0,0,0,0,0,0,0,0,0,0,0,0,0,0]
["*",null,null,null,null,"December"]
["*",null,null,null,null,"Number Purchased"]
["*",null,null,null,null,"Total Live Wt. kg"]
["*",null,null,null,null,"Total Dress Wt. kg",{"$f":"IF(G239<>0,G239*DrPercent,0)","v":0},0,0,0,0,0,0,0,0,0,0,0,0,0,0,0,0,0,0,0,0,0,0,0,0,0,0,0,0,0,0,0,0,0,0,0,0,0,0,0]
["*"]
["*",null,null,null,null,"Annual Purchases",{"$f":"G194+G198+G202+G206+G210+G214+G218+G222+G226+G230+G234+G238","v":0},{"$f":"H194+H198+H202+H206+H210+H214+H218+H222+H226+H230+H234+H238","v":0},0,0,0,0,0,0,0,0,0,0,0,0,0,0,0,0,0,0,0,0,0,0,0,0,0,0,0,0,0,0,0,0,0,0,0,0,0,0]
["*",null,null,null,null,"Annual L.WT",{"$f":"G195+G199+G203+G207+G211+G215+G219+G223+G227+G231+G235+G239","v":0},{"$f":"H195+H199+H203+H207+H211+H215+H219+H223+H227+H231+H235+H239","v":0},0,0,0,0,0,0,0,0,0,0,0,0,0,0,0,0,0,0,0,0,0,0,0,0,0,0,0,0,0,0,0,0,0,0,0,0,0,0]
["*",null,null,null,null,"Annual D.WT",0,{"$f":"H196+H200+H204+H208+H212+H216+H220+H224+H228+H232+H236+H240","v":0},0,0,0,0,0,0,0,0,0,0,0,0,0,0,0,0,0,0,0,0,0,0,0,0,0,0,0,0,0,0,0,0,0,0,0,0,0,0]
["*",null,null,null,null,"Dress % (Trim 1)",{"$f":"IF(G243<>0,G244/G243,\"\")","v":""},{"$f":"IF(H243<>0,H244/H243,\"\")","v":""},"","","","","","","","","","","","","","","","","","","","","","","","","","","","","","","","","","","","","",""]
["*"]
["*"]
["*"]
[{"$f":"IF($B$3=TRUE,\"\",\"*\")","v":""},null,null,null,null,"Total Purchases"]
[{"$f":"A249","v":""},null,null,null,null,"Live Wt./yr kg"]
[{"$f":"A250","v":""},null,null,null,null,"D. Wt/yr kg",{"$f":"IF(G250<>0,G250*DrPercent,0)","v":0},0,0,0,0,0,0,0,0,0,0,0,0,0,0,0,0,0,0,0,0,0,0,0,0,0,0,0,0,0,0,0,0,0,0,0,0,0,0,0]
[null,null,null,null,null,"Dress % (Trim 1)",{"$f":"IF(G250<>0,G251/G250,\"\")","v":""},{"$f":"IF(H250<>0,H251/H250,\"\")","v":""},{"$f":"IF(I250<>0,I251/I250,\"\")","v":""},"","","","","","","","","","","","","","","","","","","","","","","","","","","","","","","","","","","","",""]
[]
["*"]
["*"]
["*",null,null,null,null,"Annual Purchases",{"$f":"IF($B$1=TRUE,G188,IF($B$2=TRUE,G242,G249))","v":0},{"$f":"IF($B$1=TRUE,H188,IF($B$2=TRUE,H242,H249))","v":0},0,0,0,0,0,0,0,0,0,0,0,0,0,0,0,0,0,0,0,0,0,0,0,0,0,0,0,0,0,0,0,0,0,0,0,0,0,0]
["*",null,null,null,null,"Annual L.WT",{"$f":"IF($B$1=TRUE,G189,IF($B$2=TRUE,G243,G250))","v":0},0,0,0,0,0,0,0,0,0,0,0,0,0,0,0,0,0,0,0,0,0,0,0,0,0,0,0,0,0,0,0,0,0,0,0,0,0,0,0]
["*",null,null,null,null,"Annual D.WT",{"$f":"IF($B$1=TRUE,G190,IF($B$2=TRUE,G244,G251))","v":0},0,0,0,0,0,0,0,0,0,0,0,0,0,0,0,0,0,0,0,0,0,0,0,0,0,0,0,0,0,0,0,0,0,0,0,0,0,0,0]
["*",null,null,null,null,"Weekly Purchases",{"$f":"G256/365.25*7","v":0},{"$f":"H256/365.25*7","v":0},0,0,0,0,0,0,0,0,0,0,0,0,0,0,0,0,0,0,0,0,0,0,0,0,0,0,0,0,0,0,0,0,0,0,0,0,0,0]
["*",null,null,null,null,"Dress % (Trim 1)",{"$f":"IF(G257<>0,G258/G257,\"\")","v":""},{"$f":"IF(H257<>0,H258/H257,\"\")","v":""},"","","","","","","","","","","","","","","","","","","","","","","","","","","","","","","","","","","","","",""]
["*",null,null,null,null,"Av. L.wt",{"$f":"IF(G256<>0,G257/G256,\"\")","v":""},{"$f":"IF(H256<>0,H257/H256,\"\")","v":""},"","","","","","","","","","","","","","","","","","","","","","","","","","","","","","","","","","","","","",""]
["*",null,null,null,null,"Av. D. Wt",{"$f":"IF(G256<>0,G258/G256,\"\")","v":""},{"$f":"IF(H256<>0,H258/H256,\"\")","v":""},"","","","","","","","","","","","","","","","","","","","","","","","","","","","","","","","","","","","","",""]

{"sheet":"FarmDesign","index":7,"n_rows":23,"n_cols":14,"rows_kept":23,"cut":false,"hidden":false,"merged":[[14,4,14,6],[15,4,15,6],[16,4,16,6],[19,4,19,6],[14,13,14,14],[15,13,15,14],[16,13,16,14],[17,13,17,14],[18,13,18,14],[20,4,20,6],[22,13,22,14],[17,4,17,6],[18,4,18,6],[22,4,22,6],[21,4,21,6],[20,13,20,14],[21,13,21,14],[19,13,19,14],[12,3,12,6],[2,6,5,15],[8,7,8,12],[13,13,13,14],[12,12,12,14],[13,4,13,6],[10,7,10,12],[6,7,6,9]]}
[]
[]
[null,null,null,null,null,null,"Farm Details"]
[]
[]
[]
[null,null,null,null,"Select State",null,null,"NSW"]
[]
[null,null,null,null,"Business Name",null,null,"Harry's Happy Hogs"]
[]
[null,null,null,null,"Project Title",null,null,"1000 sow multisite"]
[]
[null,null,null,"Unit Name",null,null,null,null,"Pig Categories",null,null,null,"Diet Names"]
[null,null,null,1,"Breeder",null,null,null,1,"Gilts","Breeder",null,1,"Sucker"]
[null,null,null,2,"Weaner",null,null,null,2,"Boars","Breeder",null,2,"Weaner"]
[null,null,null,3,"GrowOut",null,null,null,3,"Gest Sows","Breeder",null,3,"Grower"]
[null,null,null,4,null,null,null,null,4,"Lac Sows","Lac Sow",null,4,"Finisher"]
[null,null,null,5,null,null,null,null,5,"Suckers","Grower",null,5,"LacSow"]
[null,null,null,6,null,null,null,null,6,"Weaners","Grower",null,6,"DrySow"]
[null,null,null,7,null,null,null,null,7,"Growers","Grower",null,7]
[null,null,null,8,null,null,null,null,8,"Finishers","Grower",null,8]
[null,null,null,9,null,null,null,null,9,null,null,null,9]
[null,null,null,10,null,null,null,null,10,null,null,null,10]

{"sheet":"Energy Entry","index":8,"n_rows":57,"n_cols":21,"rows_kept":57,"cut":false,"hidden":false,"merged":[[2,3,4,10]]}
[]
[]
[null,null,null,"ON FARM ENERGY USE"]
[null,null,null,null,null,null,null,null,null,null,null,null,null,null,"*","*","*","*","*","*","*"]
[]
[]
[null,null,null,"#","Code","Unit","Type","Units",null,"Notes","kg CO2-e",null,null,null,null,null,null,null,"Unit","Code"]
[null,null,null,1,{"$f":"IF(ISBLANK(G8),\"\",VLOOKUP(G8,$P$7:$T$17,5,FALSE)&F8)","v":"EBreeder"},"Breeder","Purchased Electricity",315000,{"$f":"IF(G8<>\"\",VLOOKUP(G8,$P$8:$S$17,4,FALSE),\"\")","v":"kWh"},null,{"$f":"IF(ISBLANK(G8),\"\",VLOOKUP(G8,$P$8:$Q$17,2,FALSE)*H8)","v":280350},null,null,null,null,"Purchased Electricity",{"$f":"VLOOKUP(HomeState,Electricity,2,FALSE)","v":0.89},"kgCOe2/kWh","kWh","E"]
[null,null,null,2,"EWeaner","Weaner","Purchased Electricity",4800,"kWh",null,4272,null,null,null,null,{"$f":"Assumption!B116","v":"Petrol (Stationary)"},{"$f":"Assumption!I116","v":2.2948200000000005},"kg CO2-e/l","l","S"]
[null,null,null,3,"EGrowOut","GrowOut","Purchased Electricity",14500,"kWh",null,12905,null,null,null,null,{"$f":"Assumption!B117","v":"Heating Oil  (Stationary)"},{"$f":"Assumption!I117","v":2.5744459999999996},{"$f":"R9","v":"kg CO2-e/l"},"l","S"]
[null,null,null,4,"TBreeder","Breeder","Diesel(Transport)",1500,"l",null,4047.2100000000005,null,null,null,null,{"$f":"Assumption!B118","v":"Diesel (Stationary)"},{"$f":"Assumption!I118","v":2.6827000000000001},{"$f":"R10","v":"kg CO2-e/l"},"l","S"]
[null,null,null,5,"TWeaner","Weaner","Diesel(Transport)",700,"l",null,1888.6980000000003,null,null,null,null,{"$f":"Assumption!B119","v":"Biodiesel (Stationary)"},{"$f":"Assumption!I119","v":8.9960000000000005E-3},"kg CO2-e/l","l","S"]
[null,null,null,6,"TGrowOut","GrowOut","Diesel(Transport)",250,"l",null,674.53500000000008,null,null,null,null,{"$f":"Assumption!B120","v":"LPG (Stationary)"},{"$f":"Assumption!I120","v":1.5394300000000001},"kg CO2-e/l","l","S"]
[null,null,null,7,"TBreeder","Breeder","Petrol (Transport",500,"l",null,1190.1600000000001,null,null,null,null,{"$f":"Assumption!B121","v":"Petrol (Transport"},{"$f":"Assumption!I121","v":2.3803200000000002},"kg CO2-e/l","l","T"]
[null,null,null,8,"TWeaner","Weaner","Petrol (Transport",200,"l",null,476.06400000000002,null,null,null,null,{"$f":"Assumption!B122","v":"Diesel(Transport)"},{"$f":"Assumption!I122","v":2.6981400000000004},"kg CO2-e/l","l","T"]
[null,null,null,9,"TGrowOut","GrowOut","Petrol (Transport",125,"l",null,297.54000000000002,null,null,null,null,{"$f":"Assumption!B123","v":"Biodiesel (Transport)"},{"$f":"Assumption!I123","v":0.11764000000000001},"kg CO2-e/l","l","T"]
[null,null,null,10,"SBreeder","Breeder","LPG (Stationary)",35500,"l",null,54649.764999999999,null,null,null,null,{"$f":"Assumption!B124","v":"LPG (Transport)"},{"$f":"Assumption!I124","v":1.5929599999999999},"kg CO2-e/l","l","T"]
[null,null,null,11,"SWeaner","Weaner","LPG (Stationary)",8500,"l",null,13085.155000000001]
[null,null,null,12,"",null,null,null,"",null,""]
[null,null,null,13,"",null,null,null,"",null,""]
[null,null,null,14,"",null,null,null,"",null,""]
[null,null,null,15,"",null,null,null,"",null,""]
[null,null,null,16,"",null,null,null,"",null,""]
[null,null,null,17,"",null,null,null,"",null,""]
[null,null,null,18,"",null,null,null,"",null,""]
[null,null,null,19,"",null,null,null,"",null,""]
[null,null,null,20,"",null,null,null,"",null,""]
[null,null,null,21,"",null,null,null,"",null,""]
[null,null,null,22,"",null,null,null,"",null,""]
[null,null,null,23,"",null,null,null,"",null,""]
[null,null,null,24,"",null,null,null,"",null,""]
[null,null,null,25,"",null,null,null,"",null,""]
[null,null,null,26,"",null,null,null,"",null,""]
[null,null,null,27,"",null,null,null,"",null,""]
[null,null,null,28,"",null,null,null,"",null,""]
[null,null,null,29,"",null,null,null,"",null,""]
[null,null,null,30,"",null,null,null,"",null,""]
[null,null,null,31,"",null,null,null,"",null,""]
[null,null,null,32,"",null,null,null,"",null,""]
[null,null,null,33,{"$f":"IF(ISBLANK(G40),\"\",VLOOKUP(G40,$P$7:$T$17,5,FALSE)&F40)","v":""},null,null,null,{"$f":"IF(G40<>\"\",VLOOKUP(G40,$P$8:$S$17,4,FALSE),\"\")","v":""},null,{"$f":"IF(ISBLANK(G40),\"\",VLOOKUP(G40,$P$8:$Q$17,2,FALSE)*H40)","v":""}]
[null,null,null,34,"",null,null,null,"",null,""]
[null,null,null,35,"",null,null,null,"",null,""]
[null,null,null,36,"",null,null,null,"",null,""]
[null,null,null,37,"",null,null,null,"",null,""]
[null,null,null,38,"",null,null,null,"",null,""]
[null,null,null,39,"",null,null,null,"",null,""]
[null,null,null,40,"",null,null,null,"",null,""]
[null,null,null,41,"",null,null,null,"",null,""]
[null,null,null,42,"",null,null,null,"",null,""]
[null,null,null,43,"",null,null,null,"",null,""]
[null,null,null,44,"",null,null,null,"",null,""]
[null,null,null,45,"",null,null,null,"",null,""]
[null,null,null,46,"",null,null,null,"",null,""]
[null,null,null,47,"",null,null,null,"",null,""]
[null,null,null,48,"",null,null,null,"",null,""]
[null,null,null,49,"",null,null,null,"",null,""]
[null,null,null,50,"",null,null,null,"",null,""]

{"sheet":"GrowthCurve","index":9,"n_rows":71,"n_cols":37,"rows_kept":71,"cut":false,"hidden":false,"merged":[[2,9,5,23],[17,7,17,9],[17,10,17,12],[17,13,17,15],[17,16,17,18],[17,34,17,36],[17,19,17,21],[17,22,17,24],[17,25,17,27],[17,28,17,30],[17,31,17,33]]}
[]
[]
[null,null,null,null,null,null,null,null,null,"Pig Feed kg & Growth Curves"]
[null,null,null,"Selected Geonotype",null,{"$f":"MATCH(Genetics!F6,Genetics!L7:L16,0)","v":10}]
[]
[]
[]
[null,null,null,"Age (d) In",120]
[null,null,null,"Age (d) Out",170]
[]
[null,null,null,null,"Wt","Feed kg","Days"]
[null,null,null,"In",{"$f":"VLOOKUP(E8,$D$20:$F$71,2,TRUE)","v":77.400000000000006},{"$f":"VLOOKUP(E8,$D$20:$F$71,3,TRUE)","v":215.03577600000003},{"$f":"INDEX($D$20:$D$71,MATCH(F12,$F$20:$F$71))","v":119},1,{"$f":"H12+1","v":2},{"$f":"I12+1","v":3},4,5,6,7,8,9,10,11,12,13,14,15,16,17,18,19,20,21,22,23,24,25,26,27,28,29,30]
[null,null,null,"Out",{"$f":"VLOOKUP(E9,$D$20:$F$71,2,TRUE)","v":119.1},{"$f":"VLOOKUP(E9,$D$20:$F$71,3,TRUE)","v":381.31056000000007},{"$f":"INDEX($D$20:$D$71,MATCH(F13,$F$20:$F$71))","v":168}]
[null,null,null,null,"Net Kg",{"$f":"F13-F12","v":166.27478400000004},{"$f":"G13-G12","v":49}]
[null,null,null,null,"Net Kg/Day",{"$f":"F14/G14","v":3.3933629387755109}]
[]
[]
[null,null,null,{"$f":"1+F4*3-3","v":28},{"$f":"D18+1","v":29},{"$f":"E18+1","v":30},null,"GenoType 1",null,null,"GenoType 2",null,null,"GenoType 3",null,null,"GenoType 4",null,null,"GenoType 5",null,null,"GenoType 6",null,null,"GenoType 7",null,null,"GenoType 8",null,null,"GenoType 9",null,null,"GenoType 10"]
[null,null,null,"Age (d)","kg","Feed kg",null,"Age (d)","Wt kg","Feed kg","Age (d)","Wt kg","Feed kg","Age (d)","Wt kg","Feed kg","Age (d)","Wt kg","Feed kg","Age (d)","Wt kg","Feed kg","Age (d)","Wt kg","Feed kg","Age (d)","Wt kg","Feed kg","Age (d)","Wt kg","Feed kg","Age (d)","Wt kg","Feed kg","Age (d)","Wt kg","Feed kg"]
[null,null,null,{"$f":"INDEX($H20:$AK20,D$18)","v":0},1.4,2.4501120000000003,null,null,null,null,null,null,null,0,1.4,{"$f":"(0.0027*N20+0.5469)*3*O20","v":2.29698},0,1.4,{"$f":"(0.0027*Q20+0.5469)*3.1*R20","v":2.3735460000000002},{"$f":"Q20","v":0},1.4,{"$f":"(0.0027*T20+0.5469)*2.89*U20","v":2.2127574000000001},{"$f":"T20","v":0},1.4,{"$f":"(0.0027*W20+0.5469)*3.15*X20","v":2.411829},{"$f":"Q20","v":0},1.4,{"$f":"(0.0027*Z20+0.5469)*2.8*AA20","v":2.1438479999999998},{"$f":"Q20","v":0},1.4,{"$f":"(0.0027*AC20+0.5469)*3.22*AD20","v":2.4654252000000003},{"$f":"AC20","v":0},1.4,{"$f":"(0.0027*AF20+0.5469)*3*AG20","v":2.29698},0,1.4,{"$f":"(0.0027*AI20+0.5469)*3.2*AJ20","v":2.4501120000000003}]
[null,null,null,7,3.1,5.6127360000000017,null,null,null,null,null,null,null,7,3.2,{"$f":"(0.0027*N21+0.5469)*3*O21","v":5.431680000000001},7,2.8,{"$f":"(0.0027*Q21+0.5469)*3.1*R21","v":4.9111440000000002},{"$f":"Q21","v":7},2.9,{"$f":"(0.0027*T21+0.5469)*2.89*U21","v":4.7419698000000006},{"$f":"T21","v":7},3,{"$f":"(0.0027*W21+0.5469)*3.15*X21","v":5.3468100000000005},{"$f":"Q21","v":7},3.1,{"$f":"(0.0027*Z21+0.5469)*2.8*AA21","v":4.9111440000000002},{"$f":"Q21","v":7},3.2,{"$f":"(0.0027*AC21+0.5469)*3.22*AD21","v":5.8300032000000011},{"$f":"AC21","v":7},3.2,{"$f":"(0.0027*AF21+0.5469)*3*AG21","v":5.431680000000001},7,3.1,5.6127360000000017]
[null,null,null,14,4.5,8.4196799999999996,null,null,null,null,null,null,null,14,4.7,8.2442700000000002,14,3.8,6.8877660000000001,14,4,6.7591320000000001,14,4.2,7.7355809999999998,14,4.5,7.3672199999999997,14,4.7,8.8488498000000018,14,5,8.7705000000000002,14,4.5,8.4196799999999996]
[null,null,null,21,6.3,12.168576,null,null,null,null,null,null,null,21,6.8,12.31344,21,5.0999999999999996,9.542916,21,5.5,9.5942220000000002,21,5.9,11.217906000000001,21,6.3,10.647504,21,6.8,13.216425600000001,21,7.2,13.03776,21,6.3,12.168576]
[null,null,null,28,8.6,17.1312,null,null,null,null,null,null,null,28,9.3000000000000007,17.367750000000004,28,6.6,12.736350000000002,28,7.2,12.952980000000002,28,7.9,15.490912500000002,28,8.6,14.989800000000001,28,9.3000000000000007,18.641385000000003,28,10.1,18.861750000000001,28,8.6,17.1312]
[null,null,null,35,11.4,23.398272000000006,null,null,null,null,null,null,null,35,12.5,24.052500000000006,35,8.5,16.90089,35,9.3000000000000007,17.238907800000003,35,10.3,20.810223000000001,35,11.4,20.473488000000003,35,12.5,25.816350000000003,35,13.7,26.361540000000005,35,11.4,23.398272000000006]
[null,null,null,42,14.7,31.060512000000006,null,null,null,null,null,null,null,42,16.3,32.288670000000003,42,10.6,21.697458000000005,42,11.9,22.708377300000006,42,13.2,27.455274000000003,42,14.7,27.177948000000004,42,16.3,34.656505800000012,42,18,35.656200000000005,42,14.7,31.060512000000006]
[null,null,null,49,18.600000000000001,40.425984000000007,null,null,null,null,null,null,null,49,20.7,42.178320000000006,49,13.1,27.582312000000002,49,14.7,28.854453600000003,49,16.5,35.30142,49,18.600000000000001,35.372736000000003,49,20.7,45.271396799999998,49,23,46.86480000000001,49,18.600000000000001,40.425984000000007]
[null,null,null,56,23,51.380160000000011,null,null,null,null,null,null,null,56,25.7,53.823509999999999,56,15.9,34.409349000000006,56,18,36.315162000000008,56,20.3,44.640004500000003,56,23,44.957639999999998,56,25.7,57.770567400000004,56,28.6,59.896980000000006,56,23,51.380160000000011]
[null,null,null,63,27.9,64.013760000000005,null,null,null,null,null,null,null,63,31.2,67.111200000000011,63,19,42.231300000000005,63,21.7,44.965221000000007,63,24.6,55.560330000000008,63,27.9,56.012039999999999,63,31.2,72.032688000000007,63,34.799999999999997,74.854799999999997,63,27.9,64.013760000000005]
[null,null,null,70,33.200000000000003,78.182016000000004,null,null,null,null,null,null,null,70,37.200000000000003,82.126440000000002,70,22.5,51.329025000000009,70,25.7,54.6575007,70,29.2,67.688081999999994,70,33.200000000000003,68.409264000000007,70,37.200000000000003,88.149045600000022,70,41.4,91.398780000000002,70,33.200000000000003,78.182016000000004]
[null,null,null,77,38.9,93.957504,null,null,null,null,null,null,null,77,43.6,98.727840000000015,77,26.3,61.538843999999997,77,30.1,65.659297200000012,77,34.200000000000003,81.314604000000003,77,38.9,82.212815999999989,77,43.6,105.96788160000003,77,48.5,109.82340000000001,77,38.9,93.957504]
[null,null,null,84,44.9,111.16521600000002,null,null,null,null,null,null,null,84,50.3,116.75133000000001,84,30.3,72.673641000000003,84,34.799999999999997,77.812556399999991,84,39.5,96.267622500000002,84,44.9,97.269564000000003,84,50.3,125.31309420000002,84,55.8,129.51738,84,44.9,111.16521600000002]
[null,null,null,91,51.2,129.85958400000001,null,null,null,null,null,null,null,91,57.2,136.01016000000001,91,34.700000000000003,85.259982000000022,91,39.700000000000003,90.937375800000012,91,45.1,112.60071900000001,91,51.2,113.62713600000001,91,57.2,145.98423840000004,91,63.2,150.27696,91,51.2,129.85958400000001]
[null,null,null,98,57.6,149.57568000000003,null,null,null,null,null,null,null,98,64.2,156.29490000000004,98,39.200000000000003,98.613480000000024,98,44.9,105.30105150000003,98,50.9,130.11185250000003,98,57.6,130.87872000000002,98,64.2,167.75652600000004,98,70.8,172.36260000000001,98,57.6,149.57568000000003]
[null,null,null,105,64.2,170.59737600000003,null,null,null,null,null,null,null,105,71.3,177.62255999999999,105,43.9,113.009136,105,50.3,120.71275680000001,105,56.9,148.83674399999998,105,64.2,149.272704,105,71.3,190.6482144,105,78.3,195.06095999999999,105,64.2,170.59737600000003]
[null,null,null,112,70.8,192.41740799999999,null,null,null,null,null,null,null,112,78.3,199.50057000000001,112,48.8,128.48210399999999,112,55.8,136.95981660000001,112,63,168.54358500000001,112,70.8,168.36523199999999,112,78.3,214.13061180000003,112,85.7,218.35503000000003,112,70.8,192.41740799999999]
[null,null,null,119,77.400000000000006,215.03577600000003,null,null,null,null,null,null,null,119,85.3,222.17238000000003,119,53.9,145.06753800000001,119,61.4,154.05861720000001,119,69.099999999999994,188.976753,119,77.400000000000006,188.15630400000003,119,85.3,238.46502120000002,119,92.9,241.96734000000006,119,77.400000000000006,215.03577600000003]
[null,null,null,126,83.9,238.16860800000003,null,null,null,null,null,null,null,126,92.1,245.10572999999997,126,59,162.25059000000002,126,67,171.76917300000002,126,75.2,210.13624799999999,126,83.9,208.39753199999998,126,92.1,263.08015019999999,126,99.9,265.86387000000002,126,83.9,238.16860800000003]
[null,null,null,133,90.3,261.79776000000004,null,null,null,null,null,null,null,133,98.6,267.9948,133,64.2,180.31212000000005,133,72.7,190.35331800000003,133,81.2,231.73668000000004,133,90.3,229.07304000000002,133,98.6,287.64775200000003,133,106.6,289.73880000000003,133,90.3,261.79776000000004]
[null,null,null,140,96.5,285.60912000000008,null,null,null,null,null,null,null,140,105,291.34350000000001,140,69.400000000000006,198.98298600000004,140,78.3,209.29284630000001,140,87.2,254.05153200000004,140,96.5,249.90797999999998,140,105,312.70869000000005,140,113,313.54110000000003,140,96.5,285.60912000000008]
[null,null,null,147,102.5,309.56640000000004,null,null,null,null,null,null,null,147,111.1,314.56854000000004,147,74.599999999999994,218.26318800000001,147,83.9,228.84412980000005,147,93,276.48621000000003,147,102.5,270.87060000000002,147,111.1,337.63689959999999,147,119.1,337.21974,147,102.5,309.56640000000004]
[null,null,null,154,108.3,333.63331200000005,null,null,null,null,null,null,null,154,116.9,337.61889000000008,154,79.8,238.15272600000003,154,89.4,248.72894820000005,154,98.7,299.30824350000006,154,108.3,291.929148,154,116.9,362.37760860000009,154,124.8,360.43488000000008,154,108.3,333.63331200000005]
[null,null,null,161,113.8,357.45945600000005,null,null,null,null,null,null,null,161,122.3,360.14903999999996,161,84.9,258.34730400000007,161,94.7,268.64723279999998,161,104.2,322.19056799999998,161,113.8,312.77702399999998,161,122.3,386.55996960000004,161,130.1,383.11847999999998,161,113.8,357.45945600000005]
[null,null,null,168,119.1,381.31056000000007,null,null,null,null,null,null,null,168,127.5,382.69125000000008,168,89.9,278.82934500000005,168,99.9,288.85535550000009,168,109.5,345.09746250000001,168,119.1,333.64674000000002,168,127.5,410.75527500000004,168,135.1,405.50265000000007,168,119.1,381.31056000000007]
[null,null,null,175,124.1,404.82412800000003,null,null,null,null,null,null,null,175,132.30000000000001,404.59986000000009,175,94.9,299.89728600000001,175,105,309.33693000000005,175,114.6,367.99320599999999,175,124.1,354.22111200000001,175,132.30000000000001,434.27051640000013,175,139.69999999999999,427.23054000000002,175,124.1,404.82412800000003]
[null,null,null,182,128.80000000000001,427.94572800000009,null,null,null,null,null,null,null,182,136.9,426.42981000000003,182,99.7,320.90738100000004,182,109.9,329.77550130000003,182,119.5,390.84207750000002,182,128.80000000000001,374.45251200000001,182,136.9,457.70132940000008,182,144,448.54559999999998,182,128.80000000000001,427.94572800000009]
[null,null,null,189,133.30000000000001,450.95923200000004,null,null,null,null,null,null,null,189,141.1,447.51275999999996,189,104.3,341.824476,189,114.6,350.13829679999992,189,124.1,413.27533799999992,189,133.30000000000001,394.58932799999997,189,141.1,480.33036239999996,189,147.9,469.07963999999998,189,133.30000000000001,450.95923200000004]
[null,null,null,{"$f":"INDEX($H48:$AK48,D$18)","v":0},0,0]
[null,null,null,0,0,0]
[null,null,null,0,0,0]
[null,null,null,0,0,0]
[null,null,null,0,0,0]
[null,null,null,{"$f":"INDEX($H53:$AK53,D$18)","v":0},0,0]
[null,null,null,0,0,0]
[null,null,null,0,0,0]
[null,null,null,0,0,0]
[null,null,null,0,0,0]
[null,null,null,0,0,0]
[null,null,null,0,0,0]
[null,null,null,0,0,0]
[null,null,null,0,0,0]
[null,null,null,0,0,0]
[null,null,null,0,0,0]
[null,null,null,0,0,0]
[null,null,null,0,0,0]
[null,null,null,0,0,0]
[null,null,null,0,0,0]
[null,null,null,0,0,0]
[null,null,null,0,0,0]
[null,null,null,0,0,0]
[null,null,null,0,0,0]

{"sheet":"Genetics","index":10,"n_rows":30,"n_cols":63,"rows_kept":30,"cut":false,"hidden":false,"merged":[[3,17,3,19],[17,17,17,19],[5,5,5,8],[3,13,3,15],[17,13,17,15],[3,5,4,8]]}
[null,null,null,null,null,null,null,null,null,null,null,null,null,null,null,null,null,null,null,null,null,null,null,null,null,null,null,null,null,null,null,null,null,null,null,null,null,null,null,null,null,null,null,null,null,null,null,null,null,null,null,null,null,null,null,null,null,null,null,null,null,null,0]
[]
[]
[null,null,null,null,null,"Select Pig Performance",null,null,null,null,null,null,null,"Wt (kg) @ days",null,null,null,"Growth Rate"]
[null,null,null,null,null,null,null,null,null,null,null,null,"              "]
[null,null,null,null,null,"GenoType 10",null,null,null,null,null,null,"Age in days =>",80,null,161,null,{"$f":"N6","v":80},null,{"$f":"P6","v":161}]
[null,null,null,null,null,null,null,null,null,null,null,{"$f":"GrowthCurve!$H$18","v":"GenoType 1"},null,{"$f":"VLOOKUP(N$6,GrowthCurve!$H$20:$J$71,2,TRUE)","v":{"$error":"#N/A"}},null,{"$f":"VLOOKUP(P$6,GrowthCurve!$H$20:$J$71,2,TRUE)","v":{"$error":"#N/A"}},null,{"$f":"N7/N$6*1000","v":{"$error":"#N/A"}},null,{"$f":"P7/P$6*1000","v":{"$error":"#N/A"}}]
[null,null,null,null,null,null,null,null,null,null,null,{"$f":"GrowthCurve!$K$18","v":"GenoType 2"},null,{"$f":"VLOOKUP(N$6,GrowthCurve!$K$20:$M$71,2,TRUE)","v":{"$error":"#N/A"}},null,{"$f":"VLOOKUP(P$6,GrowthCurve!$K$20:$M$71,2,TRUE)","v":{"$error":"#N/A"}},null,{"$f":"N8/N$6*1000","v":{"$error":"#N/A"}},null,{"$f":"P8/P$6*1000","v":{"$error":"#N/A"}}]
[null,null,null,null,null,null,null,null,null,null,null,{"$f":"GrowthCurve!$N$18","v":"GenoType 3"},null,{"$f":"VLOOKUP(N$6,GrowthCurve!$N$20:$P$71,2,TRUE)","v":43.6},null,{"$f":"VLOOKUP(P$6,GrowthCurve!$N$20:$P$71,2,TRUE)","v":122.3},null,545,null,759.62732919254665]
[null,null,null,null,null,null,null,null,null,null,null,{"$f":"GrowthCurve!$Q$18","v":"GenoType 4"},null,{"$f":"VLOOKUP(N$6,GrowthCurve!$Q$20:$S$71,2,TRUE)","v":26.3},null,{"$f":"VLOOKUP(P$6,GrowthCurve!$Q$20:$S$71,2,TRUE)","v":84.9},null,328.75,null,527.32919254658384]
[null,null,null,null,null,null,null,null,null,null,null,{"$f":"GrowthCurve!$T$18","v":"GenoType 5"},null,{"$f":"VLOOKUP(N$6,GrowthCurve!$T$20:$V$71,2,TRUE)","v":30.1},null,{"$f":"VLOOKUP(P$6,GrowthCurve!$T$20:$V$71,2,TRUE)","v":94.7},null,376.25000000000006,null,588.1987577639751]
[null,null,null,null,null,null,null,null,null,null,null,{"$f":"GrowthCurve!$W$18","v":"GenoType 6"},null,{"$f":"VLOOKUP(N$6,GrowthCurve!$W$20:$Y$71,2,TRUE)","v":34.200000000000003},null,{"$f":"VLOOKUP(P$6,GrowthCurve!$W$20:$Y$71,2,TRUE)","v":104.2},null,427.50000000000006,null,647.20496894409939]
[null,null,null,null,null,null,null,null,null,null,null,{"$f":"GrowthCurve!$Z$18","v":"GenoType 7"},null,{"$f":"VLOOKUP(N$6,GrowthCurve!$Z$20:$AB$71,2,TRUE)","v":38.9},null,{"$f":"VLOOKUP(P$6,GrowthCurve!$Z$20:$AB$71,2,TRUE)","v":113.8},null,486.24999999999994,null,706.83229813664593]
[null,null,null,null,null,null,null,null,null,null,null,{"$f":"GrowthCurve!$AC$18","v":"GenoType 8"},null,{"$f":"VLOOKUP(N$6,GrowthCurve!$AC$20:$AE$71,2,TRUE)","v":43.6},null,{"$f":"VLOOKUP(P$6,GrowthCurve!$AC$20:$AE$71,2,TRUE)","v":122.3},null,545,null,759.62732919254665]
[null,null,null,null,null,null,null,null,null,null,null,{"$f":"GrowthCurve!$AF$18","v":"GenoType 9"},null,{"$f":"VLOOKUP(N$6,GrowthCurve!$AF$20:$AH$71,2,TRUE)","v":48.5},null,{"$f":"VLOOKUP(P$6,GrowthCurve!$AF$20:$AH$71,2,TRUE)","v":130.1},null,606.25,null,808.07453416149065]
[null,null,null,null,null,null,null,null,null,null,null,{"$f":"GrowthCurve!$AI$18","v":"GenoType 10"},null,{"$f":"VLOOKUP(N$6,GrowthCurve!$AI$20:$AK$71,2,TRUE)","v":38.9},null,{"$f":"VLOOKUP(P$6,GrowthCurve!$AI$20:$AK$71,2,TRUE)","v":113.8},null,486.24999999999994,null,706.83229813664593]
[]
[null,null,null,null,null,null,null,null,null,null,null,null,null,"Feed kg @ days",null,null,null,"FCR"]
[]
[null,null,null,null,null,null,null,null,null,null,null,null,null,{"$f":"N6","v":80},null,{"$f":"P6","v":161},null,{"$f":"R6","v":80},null,{"$f":"P20","v":161}]
[null,null,null,null,null,null,null,null,null,null,null,{"$f":"GrowthCurve!$H$18","v":"GenoType 1"},null,{"$f":"VLOOKUP(N$6,GrowthCurve!$H$20:$J$71,3,TRUE)","v":{"$error":"#N/A"}},null,{"$f":"VLOOKUP(P$6,GrowthCurve!$H$20:$J$71,3,TRUE)","v":{"$error":"#N/A"}},null,{"$f":"N21/N7","v":{"$error":"#N/A"}},null,{"$f":"P21/P7","v":{"$error":"#N/A"}}]
[null,null,null,null,null,null,null,null,null,null,null,{"$f":"GrowthCurve!$K$18","v":"GenoType 2"},null,{"$f":"VLOOKUP(N$6,GrowthCurve!$K$20:$M$71,3,TRUE)","v":{"$error":"#N/A"}},null,{"$f":"VLOOKUP(P$6,GrowthCurve!$K$20:$M$71,3,TRUE)","v":{"$error":"#N/A"}},null,{"$f":"N22/N8","v":{"$error":"#N/A"}},null,{"$f":"P22/P8","v":{"$error":"#N/A"}}]
[null,null,null,null,null,null,null,null,null,null,null,{"$f":"GrowthCurve!$N$18","v":"GenoType 3"},null,{"$f":"VLOOKUP(N$6,GrowthCurve!$N$20:$P$71,3,TRUE)","v":98.727840000000015},null,{"$f":"VLOOKUP(P$6,GrowthCurve!$N$20:$P$71,3,TRUE)","v":360.14903999999996},null,2.2644000000000002,null,2.9447999999999999]
[null,null,null,null,null,null,null,null,null,null,null,{"$f":"GrowthCurve!$Q$18","v":"GenoType 4"},null,{"$f":"VLOOKUP(N$6,GrowthCurve!$Q$20:$S$71,3,TRUE)","v":61.538843999999997},null,{"$f":"VLOOKUP(P$6,GrowthCurve!$Q$20:$S$71,3,TRUE)","v":258.34730400000007},null,2.33988,null,3.0429600000000008]
[null,null,null,null,null,null,null,null,null,null,null,{"$f":"GrowthCurve!$T$18","v":"GenoType 5"},null,{"$f":"VLOOKUP(N$6,GrowthCurve!$T$20:$V$71,3,TRUE)","v":65.659297200000012},null,{"$f":"VLOOKUP(P$6,GrowthCurve!$T$20:$V$71,3,TRUE)","v":268.64723279999998},null,2.1813720000000001,null,2.8368239999999996]
[null,null,null,null,null,null,null,null,null,null,null,{"$f":"GrowthCurve!$W$18","v":"GenoType 6"},null,{"$f":"VLOOKUP(N$6,GrowthCurve!$W$20:$Y$71,3,TRUE)","v":81.314604000000003},null,{"$f":"VLOOKUP(P$6,GrowthCurve!$W$20:$Y$71,3,TRUE)","v":322.19056799999998},null,2.3776199999999998,null,3.0920399999999999]
[null,null,null,null,null,null,null,null,null,null,null,{"$f":"GrowthCurve!$Z$18","v":"GenoType 7"},null,{"$f":"VLOOKUP(N$6,GrowthCurve!$Z$20:$AB$71,3,TRUE)","v":82.212815999999989},null,{"$f":"VLOOKUP(P$6,GrowthCurve!$Z$20:$AB$71,3,TRUE)","v":312.77702399999998},null,2.1134399999999998,null,2.7484799999999998]
[null,null,null,null,null,null,null,null,null,null,null,{"$f":"GrowthCurve!$AC$18","v":"GenoType 8"},null,{"$f":"VLOOKUP(N$6,GrowthCurve!$AC$20:$AE$71,3,TRUE)","v":105.96788160000003},null,{"$f":"VLOOKUP(P$6,GrowthCurve!$AC$20:$AE$71,3,TRUE)","v":386.55996960000004},null,2.4304560000000004,null,3.1607520000000005]
[null,null,null,null,null,null,null,null,null,null,null,{"$f":"GrowthCurve!$AF$18","v":"GenoType 9"},null,{"$f":"VLOOKUP(N$6,GrowthCurve!$AF$20:$AH$71,3,TRUE)","v":109.82340000000001},null,{"$f":"VLOOKUP(P$6,GrowthCurve!$AF$20:$AH$71,3,TRUE)","v":383.11847999999998},null,2.2644000000000002,null,2.9447999999999999]
[null,null,null,null,null,null,null,null,null,null,null,{"$f":"GrowthCurve!$AI$18","v":"GenoType 10"},null,{"$f":"VLOOKUP(N$6,GrowthCurve!$AI$20:$AK$71,3,TRUE)","v":93.957504},null,{"$f":"VLOOKUP(P$6,GrowthCurve!$AI$20:$AK$71,3,TRUE)","v":357.45945600000005},null,2.4153600000000002,null,3.1411200000000004]

{"sheet":"UserAssumotions","index":11,"n_rows":57,"n_cols":10,"rows_kept":57,"cut":false,"hidden":false,"merged":[[2,3,4,9]]}
[]
[]
[null,null,null,"Assumptions"]
[]
[]
[]
[null,null,null,"Pre Farm"]
[]
[null,null,null,null,"Grain & Raw Materials",null,null,250,null,"kg CO2-e/t"]
[]
[null,null,null,null,"Feed Milling & Delivery",null,null,48,null,"kg CO2-e/t"]
[]
[null,null,null,null,"Straw & Bedding",null,null,25,null,"kg CO2-e/t"]
[]
[null,null,null,null,"Pig Purchased Transport"]
[]
[null,null,null,null,null,"Pigs per load",null,null,null,"Pigs"]
[]
[null,null,null,null,null,"Distance",null,null,null,"km"]
[null,null,null,null,null,null,null,240]
[null,null,null,null,null,"Fuel Consumption",null,null,null,"l/100km"]
[]
[null,null,null,null,null,"CO2-e",null,{"$f":"IF(H17<>0,H19/100*H21/H17,0)","v":0},null,"l/pig"]
[null,null,null,null,null,null,null,{"$f":"Assumption!$I$122","v":2.6981400000000004},null,"kg CO2-e/l"]
[null,null,null,null,null,null,null,{"$f":"H23*H24","v":0},null,"kg CO2-e/Pig"]
[]
[null,null,null,"Post Farm"]
[]
[null,null,null,null,"Pig Sales Transport"]
[]
[null,null,null,null,null,"Pigs per load",null,324,"Hd","Pigs"]
[]
[null,null,null,null,null,"Distance",null,950,null,"km"]
[null,null,null,null,null,null,null,12]
[null,null,null,null,null,"Fuel Consumption",null,60,null,"l/100km"]
[]
[null,null,null,null,null,"CO2-e",null,{"$f":"IF(H31<>0,H33/100*H35/H31,0)","v":1.7592592592592593},null,"l/pig"]
[null,null,null,null,null,null,null,{"$f":"Assumption!$I$122","v":2.6981400000000004},null,"kg CO2-e/L"]
[null,null,null,null,null,null,null,{"$f":"H37*H38","v":4.746727777777779},null,"kg CO2-e/Pig"]
[]
[null,null,null,null,null,"Meat Processing",null,0.4,null,"kg CO2-e/kg HSCW"]
[]
[]
[null,null,null,"Dressing % for Transfers & Purchases",null,null,null,null,null,0.75800000000000001]
[]
[]
[null,null,null,"Manure Management System Parameters"]
[]
[null,null,null,null,null,null,null,"VS ",null,"N"]
[null,null,null,null,null,"Solid Extraction",null,"% VS sep",null,"% N Sep"]
[]
[null,null,null,null,null,"No Solids Separated",null,0,null,0]
[null,null,null,null,null,"Run Down Screen",null,0.15,null,{"$f":"5%","v":0.05}]
[null,null,null,null,null,"Screw Press",null,0.2,null,7.4999999999999997E-2]
[null,null,null,null,null,"Centrifuge",null,0.25,null,0.1]
[null,null,null,null,null,"Sedimentation",null,0.5,null,0.2]
[null,null,null,null,null,"Effluent Daily Spread",null,0.2,null,0.2]

{"sheet":"Const","index":12,"n_rows":7,"n_cols":7,"rows_kept":7,"cut":false,"hidden":false,"merged":[]}
[]
[null,"FracLEACH",0.3,"Eq 4D3_5 (DCCEE 2012)"]
[null,"EFLRO",1.2500000000000001E-2,"Eq 4D3_7 (DCCEE 2012)"]
[]
[]
[null,"EmmPot",0.45,"Emmissions Potential",null,null,"Eq 4B.8_1 (DCCEE 2012) - IPCC "]
[null,"DensCH4",0.66200000000000003,"Density of Methane",null,null,"Eq 4B.8_1 (DCCEE 2012) "]

{"sheet":"Assumption","index":13,"n_rows":124,"n_cols":9,"rows_kept":124,"cut":false,"hidden":false,"merged":[[99,1,99,9],[113,4,113,7],[86,1,86,4],[12,1,12,2],[1,1,2,1],[43,3,43,7],[37,3,37,7],[73,1,74,1],[73,2,73,6],[73,7,74,7],[100,1,100,9]]}
[null,null,null,"Table 26 (DCCEE 2011a) Global warming potentials"]
[null,"State",null,"Global Warming Conversion Factors",null,null,"Range names"]
[null,null,null,"Carbon Dioxide","CO2 ",1,"CFCO2"]
[null,"ACT",null,"Methane","CH4 ",21,"CFCH4"]
[null,"NSW",null,"Nitrous Oxide","N2O",310,"CFN20"]
[null,"Tasmania"]
[null,"Western Australia"]
[null,"South Australia",null,null,"References"]
[null,"Victoria",null,null,"DCCEE (2011a) National Greenhouse Accounts Factors. Department of Climate Change and Energy Efficiency, Commonwealth of Australia, Canberra ACT, July 2011. ISBN: 978-1-921299-86-5"]
[null,"Queensland",null,null,"DCCEE (2012) Australian National Greenhouse Accounts - National Inventory Report 2010 Volume 1. The Australian Government Submission to the UN Framework Convention on Climate Change April 2012. Department of Climate Change and Energy Efficiency, Commonwealth of Australia, Canberra ACT, April 2012. ISBN: 978-1-922003-28-7."]
[null,"Northern Territory"]
[]
[]
[]
[]
[]
[]
[]
[]
[]
[null,"Table 6.J.2 (DCCEE 2012) Fraction of animal waste available for leaching and runoff (FracWET) "]
[null,1,2,7]
[null,"State ","Region","All other categories "]
[null,"ACT",1,0.66500000000000004]
[null,"NSW",2,0.33500000000000002]
[null,"Northern Territory",3,0.77300000000000002]
[null,"Queensland",4,0.107]
[null,"South Australia",5,0.41499999999999998]
[null,"Tasmania",6,0.995]
[null,"Victoria",7,0.76800000000000002]
[null,"Western Australia",8,0.66800000000000004]
[]
[]
[]
[null,"CARCASS COMPOSITION (based on ARC 1981)"]
[]
[]
[null,null,null,"Growing & Grown Pigs"]
[null,null,null,"Nitrogen","Phosphorus","Potassium","Salt","Ash"]
[null,null,null,"g/kg","g/kg","g/kg","g/kg","g/kg"]
[null,null,null,25.6,4.5,2.4,2,29]
[]
[]
[null,null,null,"Infant Pigs"]
[null,null,null,"Nitrogen","Phosphorus","Potassium","Salt","Ash"]
[null,"NB: (These values only",null,"g/kg","g/kg","g/kg","g/kg","g/kg"]
[null,"       used for a reference).",null,24,5.5,2.1,2,29]
[]
[]
[]
[null,"Methane Conversion of Gross Energy",7.0000000000000001E-3,"Eq 4A.8_1"]
[null,"F Factor",55.22,"Eq 4A.8_1"]
[]
[null,"IPCC Default Emissions Factor (AtmosDep)",0.01,"Eq 4D3_4"]
[]
[]
[]
[null,"NITROGEN  VOLATILISATION"]
[null,1,2,3,4,5]
[null,"Table 6.31 (DCCEE 2012) Fraction of N volatilised in each manure management system (FracGASM)"]
[null,null,"N Vol"]
[null,null,"Swine "]
["MMS1",{"$f":"B89","v":"Anaerobic Lagoon"},0.4,null,null,{"$f":"B63&\",\"&B64&\",\"&B66&\",\"&B67","v":"Anaerobic Lagoon,Liquid/slurry systems,Daily Spread,Digester"}]
["MMS2",{"$f":"B90","v":"Liquid/slurry systems"},0.48,null,null,"Anaerobic Lagoon,Liquid/slurry systems,Daily Spread,Digester"]
["MMS3",{"$f":"B91","v":"Solid storage & drylot"},0.45]
["MMS4",{"$f":"B92","v":"Daily Spread"},7.0000000000000007E-2]
["MMS5",{"$f":"B93","v":"Digester"},0]
[]
[]
[]
[]
[]
[null,"Table 6.E.4 (DCCEE 2012) Pigs - Methane Conversion Factor (MCF)"]
[null,"State","Manure Management Systems ",null,null,null,null,"Integrated\nMCF\n((%)"]
[null,null,"Lagoon\n(%) ","Liquid/slurry\n(%)","Drylot\n(%)","Daily Spread\n(%)","Digester\n(%)"]
[null,"ACT",90,35,1.5,0.5,10,65.84]
[null,"NSW",90,35,1.5,0.5,10,65.84]
[null,"Tasmania",90,35,1.5,0.5,10,0.5]
[null,"Western Australia",90,35,1.5,0.5,10,58.98]
[null,"South Australia",90,35,1.5,0.5,10,65.84]
[null,"Victoria",90,35,1.5,0.5,10,64.239999999999995]
[null,"Queensland",90,65,5,1,10,84.04]
[null,"Northern Territory",90,65,5,1,10,90]
[]
[]
[]
[null,"Table 6.12 (DCCEE 2012) Emissions factors for nitrous oxide\nEmissions factors - Manure Management Systems - N2O calculations "]
[null,null,"Lookup Code","Emission Factor\n(kgs N2O  - N/kg excreted)"]
[null,"Anaerobic Lagoon",1,1E-3]
[null,"Liquid/slurry systems",2,1E-3]
[null,"Solid storage & drylot",3,0.02]
[null,"Daily Spread",4,0]
[null,"Digester",5,1E-3]
[]
[]
[]
[null,"NITROGEN  VOLATILISATION"]
[]
[]
[null," "]
[null,"Table 5 (DCCEE 2011a) Indirect (scope 2) emission factors for consumption of purchased electricity from the grid"]
[null,"State","Emission factor\nkg CO2-e/kWh"]
[null,"ACT",0.89]
[null,"NSW",0.89]
[null,"Tasmania",0.3]
[null,"Western Australia",0.8]
[null,"South Australia",0.68]
[null,"Victoria",1.21]
[null,"Queensland",0.88]
[null,"Northern Territory",0.67]
[]
[]
[null,"Tables 3 & 4 (DCCEE 2011a) Combined data - fuel consumption emission factors for stationary & transport energy purpose"]
[null,null,null,null,"Emission Factors kgCO2-e/GJ"]
[null,"Fuel Combusted","Energy",null,"CO2","CH4","N20","Total","kg CO2-e/l"]
[null,"Petrol (Stationary)","GJ/Kl",34.200000000000003,66.7,0.2,0.2,{"$f":"SUM(E116:G116)","v":67.100000000000009},{"$f":"D116*H116/1000","v":2.2948200000000005}]
[null,"Heating Oil  (Stationary)","GJ/Kl",37.299999999999997,68.8,0.02,0.2,{"$f":"SUM(E117:G117)","v":69.02},{"$f":"D117*H117/1000","v":2.5744459999999996}]
[null,"Diesel (Stationary)","GJ/Kl",38.6,69.2,0.1,0.2,69.5,2.6827000000000001]
[null,"Biodiesel (Stationary)","GJ/Kl",34.6,0,0.06,0.2,0.26,8.9960000000000005E-3]
[null,"LPG (Stationary)","GJ/Kl",25.7,59.6,0.1,0.2,59.900000000000006,1.5394300000000001]
[null,"Petrol (Transport","GJ/Kl",34.200000000000003,66.7,0.6,2.2999999999999998,69.599999999999994,2.3803200000000002]
[null,"Diesel(Transport)","GJ/Kl",38.6,69.2,0.2,0.5,69.900000000000006,2.6981400000000004]
[null,"Biodiesel (Transport)","GJ/Kl",34.6,0,1.2,2.2000000000000002,3.4000000000000004,0.11764000000000001]
[null,"LPG (Transport)","GJ/Kl",26.2,59.6,0.6,0.6,60.800000000000004,{"$f":"D124*H124/1000","v":1.5929599999999999}]

{"sheet":"PigDetails","index":14,"n_rows":121,"n_cols":57,"rows_kept":121,"cut":false,"hidden":false,"merged":[[9,3,9,4],[8,3,8,4],[3,7,7,14],[5,32,6,32],[5,33,6,33],[4,31,4,33],[5,3,5,4],[5,17,5,19],[5,31,6,31]]}
[]
[]
[]
[null,null,null,null,null,null,null,"PIG DETAILS"]
[]
[]
[]
[]
[null,null,null,"Ctrl+g = Get Growth Curve data"]
[null,null,null,"(Must Be in Feed Delvrd Row)"]
[null,null,null,null,null,"TOTAL",null,1,2,3,4,5,6,7,8,9,10,11,12,13,14,15,16,17,18,19,20,21,22,23,24,25,26,27,28,29,30,31,32,33,34,35,36,37,38,39,40,41,42,43,44,45,46,47,48,49,50]
[]
[null,null,null,"Group Details"]
[null,null,null,null,"Goup ID",null,null,"Gilts","Boars","Gest Sows","LacSow","Piglets","Weaners","Growers","Finisher"]
[null,null,null,null,"Unit",null,null,"Breeder","Breeder","Breeder","Breeder","Breeder","Weaner","GrowOut","GrowOut"]
[null,null,null,null,"Pig Category",null,null,"Gilts","Boars","Gest Sows","Lac Sows","Suckers","Weaners","Growers","Finishers"]
[null,null,null,null,"Pig Type",null,null,{"$f":"IF(H16<>\"\",VLOOKUP(H16,FarmDesign!$J$14:$K$23,2,FALSE),\"\")","v":"Breeder"},{"$f":"IF(I16<>\"\",VLOOKUP(I16,FarmDesign!$J$14:$K$23,2,FALSE),\"\")","v":"Breeder"},{"$f":"IF(J16<>\"\",VLOOKUP(J16,FarmDesign!$J$14:$K$23,2,FALSE),\"\")","v":"Breeder"},{"$f":"IF(K16<>\"\",VLOOKUP(K16,FarmDesign!$J$14:$K$23,2,FALSE),\"\")","v":"Lac Sow"},{"$f":"IF(L16<>\"\",VLOOKUP(L16,FarmDesign!$J$14:$K$23,2,FALSE),\"\")","v":"Grower"},{"$f":"IF(M16<>\"\",VLOOKUP(M16,FarmDesign!$J$14:$K$23,2,FALSE),\"\")","v":"Grower"},{"$f":"IF(N16<>\"\",VLOOKUP(N16,FarmDesign!$J$14:$K$23,2,FALSE),\"\")","v":"Grower"},{"$f":"IF(O16<>\"\",VLOOKUP(O16,FarmDesign!$J$14:$K$23,2,FALSE),\"\")","v":"Grower"},{"$f":"IF(P16<>\"\",VLOOKUP(P16,FarmDesign!$J$14:$K$23,2,FALSE),\"\")","v":""},{"$f":"IF(Q16<>\"\",VLOOKUP(Q16,FarmDesign!$J$14:$K$23,2,FALSE),\"\")","v":""},{"$f":"IF(R16<>\"\",VLOOKUP(R16,FarmDesign!$J$14:$K$23,2,FALSE),\"\")","v":""},{"$f":"IF(S16<>\"\",VLOOKUP(S16,FarmDesign!$J$14:$K$23,2,FALSE),\"\")","v":""},{"$f":"IF(T16<>\"\",VLOOKUP(T16,FarmDesign!$J$14:$K$23,2,FALSE),\"\")","v":""},{"$f":"IF(U16<>\"\",VLOOKUP(U16,FarmDesign!$J$14:$K$23,2,FALSE),\"\")","v":""},{"$f":"IF(V16<>\"\",VLOOKUP(V16,FarmDesign!$J$14:$K$23,2,FALSE),\"\")","v":""},{"$f":"IF(W16<>\"\",VLOOKUP(W16,FarmDesign!$J$14:$K$23,2,FALSE),\"\")","v":""},{"$f":"IF(X16<>\"\",VLOOKUP(X16,FarmDesign!$J$14:$K$23,2,FALSE),\"\")","v":""},{"$f":"IF(Y16<>\"\",VLOOKUP(Y16,FarmDesign!$J$14:$K$23,2,FALSE),\"\")","v":""},{"$f":"IF(Z16<>\"\",VLOOKUP(Z16,FarmDesign!$J$14:$K$23,2,FALSE),\"\")","v":""},{"$f":"IF(AA16<>\"\",VLOOKUP(AA16,FarmDesign!$J$14:$K$23,2,FALSE),\"\")","v":""},{"$f":"IF(AB16<>\"\",VLOOKUP(AB16,FarmDesign!$J$14:$K$23,2,FALSE),\"\")","v":""},{"$f":"IF(AC16<>\"\",VLOOKUP(AC16,FarmDesign!$J$14:$K$23,2,FALSE),\"\")","v":""},{"$f":"IF(AD16<>\"\",VLOOKUP(AD16,FarmDesign!$J$14:$K$23,2,FALSE),\"\")","v":""},{"$f":"IF(AE16<>\"\",VLOOKUP(AE16,FarmDesign!$J$14:$K$23,2,FALSE),\"\")","v":""},{"$f":"IF(AF16<>\"\",VLOOKUP(AF16,FarmDesign!$J$14:$K$23,2,FALSE),\"\")","v":""},{"$f":"IF(AG16<>\"\",VLOOKUP(AG16,FarmDesign!$J$14:$K$23,2,FALSE),\"\")","v":""},{"$f":"IF(AH16<>\"\",VLOOKUP(AH16,FarmDesign!$J$14:$K$23,2,FALSE),\"\")","v":""},{"$f":"IF(AI16<>\"\",VLOOKUP(AI16,FarmDesign!$J$14:$K$23,2,FALSE),\"\")","v":""},{"$f":"IF(AJ16<>\"\",VLOOKUP(AJ16,FarmDesign!$J$14:$K$23,2,FALSE),\"\")","v":""},{"$f":"IF(AK16<>\"\",VLOOKUP(AK16,FarmDesign!$J$14:$K$23,2,FALSE),\"\")","v":""},{"$f":"IF(AL16<>\"\",VLOOKUP(AL16,FarmDesign!$J$14:$K$23,2,FALSE),\"\")","v":""},{"$f":"IF(AM16<>\"\",VLOOKUP(AM16,FarmDesign!$J$14:$K$23,2,FALSE),\"\")","v":""},{"$f":"IF(AN16<>\"\",VLOOKUP(AN16,FarmDesign!$J$14:$K$23,2,FALSE),\"\")","v":""},{"$f":"IF(AO16<>\"\",VLOOKUP(AO16,FarmDesign!$J$14:$K$23,2,FALSE),\"\")","v":""},{"$f":"IF(AP16<>\"\",VLOOKUP(AP16,FarmDesign!$J$14:$K$23,2,FALSE),\"\")","v":""},{"$f":"IF(AQ16<>\"\",VLOOKUP(AQ16,FarmDesign!$J$14:$K$23,2,FALSE),\"\")","v":""},{"$f":"IF(AR16<>\"\",VLOOKUP(AR16,FarmDesign!$J$14:$K$23,2,FALSE),\"\")","v":""},{"$f":"IF(AS16<>\"\",VLOOKUP(AS16,FarmDesign!$J$14:$K$23,2,FALSE),\"\")","v":""},{"$f":"IF(AT16<>\"\",VLOOKUP(AT16,FarmDesign!$J$14:$K$23,2,FALSE),\"\")","v":""},{"$f":"IF(AU16<>\"\",VLOOKUP(AU16,FarmDesign!$J$14:$K$23,2,FALSE),\"\")","v":""},{"$f":"IF(AV16<>\"\",VLOOKUP(AV16,FarmDesign!$J$14:$K$23,2,FALSE),\"\")","v":""},{"$f":"IF(AW16<>\"\",VLOOKUP(AW16,FarmDesign!$J$14:$K$23,2,FALSE),\"\")","v":""},{"$f":"IF(AX16<>\"\",VLOOKUP(AX16,FarmDesign!$J$14:$K$23,2,FALSE),\"\")","v":""},{"$f":"IF(AY16<>\"\",VLOOKUP(AY16,FarmDesign!$J$14:$K$23,2,FALSE),\"\")","v":""},{"$f":"IF(AZ16<>\"\",VLOOKUP(AZ16,FarmDesign!$J$14:$K$23,2,FALSE),\"\")","v":""},{"$f":"IF(BA16<>\"\",VLOOKUP(BA16,FarmDesign!$J$14:$K$23,2,FALSE),\"\")","v":""},{"$f":"IF(BB16<>\"\",VLOOKUP(BB16,FarmDesign!$J$14:$K$23,2,FALSE),\"\")","v":""},{"$f":"IF(BC16<>\"\",VLOOKUP(BC16,FarmDesign!$J$14:$K$23,2,FALSE),\"\")","v":""},{"$f":"IF(BD16<>\"\",VLOOKUP(BD16,FarmDesign!$J$14:$K$23,2,FALSE),\"\")","v":""},{"$f":"IF(BE16<>\"\",VLOOKUP(BE16,FarmDesign!$J$14:$K$23,2,FALSE),\"\")","v":""}]
[null,null,null,null,null,null,null,{"$f":"H15&H16","v":"BreederGilts"},{"$f":"I15&I16","v":"BreederBoars"},"BreederGest Sows","BreederLac Sows","BreederSuckers","WeanerWeaners","GrowOutGrowers","GrowOutFinishers","","","","","","","","","","","","","","","","","","","","","","","","","","","","","","","","","","","","","","","","","",""]
[null,null,null,null,"Average Number",{"$f":"SUM(H19:BE19)","v":9176},null,50,42,843,157,1497,2295,2152,2140]
[null,null,null,null,"Maure Mangement System",null,null,"Ponds I","Ponds I","Ponds I","Ponds I","Ponds I","Straw Igloo","Ponds I","Ponds I"]
[null,null,null,"Growth Details"]
[null,null,null,null,"Age (days) In",null,null,168,168,211,null,0,27,71,113]
[null,null,null,null,"Age (days) Out",null,null,{"$f":"210","v":210},870,930,null,26,70,{"$f":"16*7","v":112},154]
[null,null,null,null,"Wt In (kg)",null,null,100,119.1,130,null,1.4,8,28,52]
[null,null,null,null,"Wt Out (kg) / Average Wt (kg)",null,null,130,195,170,null,8,28,52,95]
[null,null,null,"Straw & Bedding"]
[null,null,null,null,"kg/head/day",null,null,null,null,null,null,null,0.50104458849476352]
[null,null,null,null,"Total t/yr",null,null,0,null,null,null,null,419.99999999999994]
[null,null,null,null,"CO2-e / yr",null,null,{"$f":"H28*UserAssumotions!$H$13","v":0},{"$f":"I28*UserAssumotions!$H$13","v":0},{"$f":"J28*UserAssumotions!$H$13","v":0},{"$f":"K28*UserAssumotions!$H$13","v":0},{"$f":"L28*UserAssumotions!$H$13","v":0},{"$f":"M28*UserAssumotions!$H$13","v":10499.999999999998},{"$f":"N28*UserAssumotions!$H$13","v":0},{"$f":"O28*UserAssumotions!$H$13","v":0},{"$f":"P28*UserAssumotions!$H$13","v":0},{"$f":"Q28*UserAssumotions!$H$13","v":0},{"$f":"R28*UserAssumotions!$H$13","v":0},{"$f":"S28*UserAssumotions!$H$13","v":0},{"$f":"T28*UserAssumotions!$H$13","v":0},{"$f":"U28*UserAssumotions!$H$13","v":0},{"$f":"V28*UserAssumotions!$H$13","v":0},{"$f":"W28*UserAssumotions!$H$13","v":0},{"$f":"X28*UserAssumotions!$H$13","v":0},{"$f":"Y28*UserAssumotions!$H$13","v":0},{"$f":"Z28*UserAssumotions!$H$13","v":0},{"$f":"AA28*UserAssumotions!$H$13","v":0},{"$f":"AB28*UserAssumotions!$H$13","v":0},{"$f":"AC28*UserAssumotions!$H$13","v":0},{"$f":"AD28*UserAssumotions!$H$13","v":0},{"$f":"AE28*UserAssumotions!$H$13","v":0},{"$f":"AF28*UserAssumotions!$H$13","v":0},{"$f":"AG28*UserAssumotions!$H$13","v":0},{"$f":"AH28*UserAssumotions!$H$13","v":0},{"$f":"AI28*UserAssumotions!$H$13","v":0},{"$f":"AJ28*UserAssumotions!$H$13","v":0},{"$f":"AK28*UserAssumotions!$H$13","v":0},{"$f":"AL28*UserAssumotions!$H$13","v":0},{"$f":"AM28*UserAssumotions!$H$13","v":0},{"$f":"AN28*UserAssumotions!$H$13","v":0},{"$f":"AO28*UserAssumotions!$H$13","v":0},{"$f":"AP28*UserAssumotions!$H$13","v":0},{"$f":"AQ28*UserAssumotions!$H$13","v":0},{"$f":"AR28*UserAssumotions!$H$13","v":0},{"$f":"AS28*UserAssumotions!$H$13","v":0},{"$f":"AT28*UserAssumotions!$H$13","v":0},{"$f":"AU28*UserAssumotions!$H$13","v":0},{"$f":"AV28*UserAssumotions!$H$13","v":0},{"$f":"AW28*UserAssumotions!$H$13","v":0},{"$f":"AX28*UserAssumotions!$H$13","v":0},{"$f":"AY28*UserAssumotions!$H$13","v":0},{"$f":"AZ28*UserAssumotions!$H$13","v":0},{"$f":"BA28*UserAssumotions!$H$13","v":0},{"$f":"BB28*UserAssumotions!$H$13","v":0},{"$f":"BC28*UserAssumotions!$H$13","v":0},{"$f":"BD28*UserAssumotions!$H$13","v":0},{"$f":"BE28*UserAssumotions!$H$13","v":0}]
[null,null,null,"Feed Details"]
[null,null,null,null,"Feed Type",null,null,"DrySow","DrySow","DrySow","LacSow","Sucker","Weaner","Grower","Finisher"]
[null,null,null,null,"Wastage %",null,null,0.1,0.05,0.05,0.05,0.2,0.1,0.1,0.1]
[null,null,null,null,"Feed Delvrd (kg/day)",null,null,2.78,2.42,2.42,5.8,0.02,0.88,1.4,2.9]
[null,null,null,null,"Feed Ingested (kg/day As fed)",null,{"$f":"G33*(1-G32)","v":0},2.5019999999999998,{"$f":"I33*(1-I32)","v":2.2989999999999999},{"$f":"J33*(1-J32)","v":2.2989999999999999},5.51,1.6E-2,0.79200000000000004,1.26,2.61,0,0,0,0,0,0,0,0,0,0,0,0,0,0,0,0,0,0,0,0,0,0,0,0,0,0,0,0,0,0,0,0,0,0,0,0,0,0,0,0,0,0]
[null,null,null,"Diet Specifications"]
[null,null,null,null,"Dry Matter %",{"$f":"SUMPRODUCT(H36:O36,$H$95:$O$95)/SUM($H$95:$O$95)","v":88.472246565612977},{"$f":"HLOOKUP(G31,Feeds!$F$224:$AS$234,8,FALSE)","v":0},{"$f":"HLOOKUP(H31,Feeds!$F$224:$AS$234,8,FALSE)","v":88.380349999999993},{"$f":"HLOOKUP(I31,Feeds!$F$224:$AS$234,8,FALSE)","v":88.380349999999993},{"$f":"HLOOKUP(J31,Feeds!$F$224:$AS$234,8,FALSE)","v":88.380349999999993},{"$f":"HLOOKUP(K31,Feeds!$F$224:$AS$234,8,FALSE)","v":88.686399999999992},{"$f":"HLOOKUP(L31,Feeds!$F$224:$AS$234,8,FALSE)","v":89.27225},{"$f":"HLOOKUP(M31,Feeds!$F$224:$AS$234,8,FALSE)","v":88.629750000000001},{"$f":"HLOOKUP(N31,Feeds!$F$224:$AS$234,8,FALSE)","v":88.465099999999993},{"$f":"HLOOKUP(O31,Feeds!$F$224:$AS$234,8,FALSE)","v":88.42295},{"$f":"HLOOKUP(P31,Feeds!$F$224:$AS$234,8,FALSE)","v":0},{"$f":"HLOOKUP(Q31,Feeds!$F$224:$AS$234,8,FALSE)","v":0},{"$f":"HLOOKUP(R31,Feeds!$F$224:$AS$234,8,FALSE)","v":0},{"$f":"HLOOKUP(S31,Feeds!$F$224:$AS$234,8,FALSE)","v":0},{"$f":"HLOOKUP(T31,Feeds!$F$224:$AS$234,8,FALSE)","v":0},{"$f":"HLOOKUP(U31,Feeds!$F$224:$AS$234,8,FALSE)","v":0},{"$f":"HLOOKUP(V31,Feeds!$F$224:$AS$234,8,FALSE)","v":0},{"$f":"HLOOKUP(W31,Feeds!$F$224:$AS$234,8,FALSE)","v":0},{"$f":"HLOOKUP(X31,Feeds!$F$224:$AS$234,8,FALSE)","v":0},{"$f":"HLOOKUP(Y31,Feeds!$F$224:$AS$234,8,FALSE)","v":0},{"$f":"HLOOKUP(Z31,Feeds!$F$224:$AS$234,8,FALSE)","v":0},{"$f":"HLOOKUP(AA31,Feeds!$F$224:$AS$234,8,FALSE)","v":0},{"$f":"HLOOKUP(AB31,Feeds!$F$224:$AS$234,8,FALSE)","v":0},{"$f":"HLOOKUP(AC31,Feeds!$F$224:$AS$234,8,FALSE)","v":0},{"$f":"HLOOKUP(AD31,Feeds!$F$224:$AS$234,8,FALSE)","v":0},{"$f":"HLOOKUP(AE31,Feeds!$F$224:$AS$234,8,FALSE)","v":0},{"$f":"HLOOKUP(AF31,Feeds!$F$224:$AS$234,8,FALSE)","v":0},{"$f":"HLOOKUP(AG31,Feeds!$F$224:$AS$234,8,FALSE)","v":0},{"$f":"HLOOKUP(AH31,Feeds!$F$224:$AS$234,8,FALSE)","v":0},{"$f":"HLOOKUP(AI31,Feeds!$F$224:$AS$234,8,FALSE)","v":0},{"$f":"HLOOKUP(AJ31,Feeds!$F$224:$AS$234,8,FALSE)","v":0},{"$f":"HLOOKUP(AK31,Feeds!$F$224:$AS$234,8,FALSE)","v":0},{"$f":"HLOOKUP(AL31,Feeds!$F$224:$AS$234,8,FALSE)","v":0},{"$f":"HLOOKUP(AM31,Feeds!$F$224:$AS$234,8,FALSE)","v":0},{"$f":"HLOOKUP(AN31,Feeds!$F$224:$AS$234,8,FALSE)","v":0},{"$f":"HLOOKUP(AO31,Feeds!$F$224:$AS$234,8,FALSE)","v":0},{"$f":"HLOOKUP(AP31,Feeds!$F$224:$AS$234,8,FALSE)","v":0},{"$f":"HLOOKUP(AQ31,Feeds!$F$224:$AS$234,8,FALSE)","v":0},{"$f":"HLOOKUP(AR31,Feeds!$F$224:$AS$234,8,FALSE)","v":0},{"$f":"HLOOKUP(AS31,Feeds!$F$224:$AS$234,8,FALSE)","v":0},{"$f":"HLOOKUP(AT31,Feeds!$F$224:$AS$234,8,FALSE)","v":0},{"$f":"HLOOKUP(AU31,Feeds!$F$224:$AS$234,8,FALSE)","v":0},{"$f":"HLOOKUP(AV31,Feeds!$F$224:$AS$234,8,FALSE)","v":0},{"$f":"HLOOKUP(AW31,Feeds!$F$224:$AS$234,8,FALSE)","v":0},{"$f":"HLOOKUP(AX31,Feeds!$F$224:$AS$234,8,FALSE)","v":0},{"$f":"HLOOKUP(AY31,Feeds!$F$224:$AS$234,8,FALSE)","v":0},{"$f":"HLOOKUP(AZ31,Feeds!$F$224:$AS$234,8,FALSE)","v":0},{"$f":"HLOOKUP(BA31,Feeds!$F$224:$AS$234,8,FALSE)","v":0},{"$f":"HLOOKUP(BB31,Feeds!$F$224:$AS$234,8,FALSE)","v":0},{"$f":"HLOOKUP(BC31,Feeds!$F$224:$AS$234,8,FALSE)","v":0},{"$f":"HLOOKUP(BD31,Feeds!$F$224:$AS$234,8,FALSE)","v":0},{"$f":"HLOOKUP(BE31,Feeds!$F$224:$AS$234,8,FALSE)","v":0}]
[null,null,null,null,"Protien %",{"$f":"SUMPRODUCT(H37:O37,$H$95:$O$95)/SUM($H$95:$O$95)","v":18.071828585685395},{"$f":"HLOOKUP(G31,Feeds!$F$224:$AS$234,10,FALSE)","v":0},{"$f":"HLOOKUP(H31,Feeds!$F$224:$AS$234,10,FALSE)","v":14.609769999999997},{"$f":"HLOOKUP(I31,Feeds!$F$224:$AS$234,10,FALSE)","v":14.609769999999997},{"$f":"HLOOKUP(J31,Feeds!$F$224:$AS$234,10,FALSE)","v":14.609769999999997},{"$f":"HLOOKUP(K31,Feeds!$F$224:$AS$234,10,FALSE)","v":17.271065999999998},{"$f":"HLOOKUP(L31,Feeds!$F$224:$AS$234,10,FALSE)","v":22.710238},{"$f":"HLOOKUP(M31,Feeds!$F$224:$AS$234,10,FALSE)","v":19.838609999999999},{"$f":"HLOOKUP(N31,Feeds!$F$224:$AS$234,10,FALSE)","v":19.190943000000001},{"$f":"HLOOKUP(O31,Feeds!$F$224:$AS$234,10,FALSE)","v":18.320999999999998},{"$f":"HLOOKUP(P31,Feeds!$F$224:$AS$234,10,FALSE)","v":0},{"$f":"HLOOKUP(Q31,Feeds!$F$224:$AS$234,10,FALSE)","v":0},{"$f":"HLOOKUP(R31,Feeds!$F$224:$AS$234,10,FALSE)","v":0},{"$f":"HLOOKUP(S31,Feeds!$F$224:$AS$234,10,FALSE)","v":0},{"$f":"HLOOKUP(T31,Feeds!$F$224:$AS$234,10,FALSE)","v":0},{"$f":"HLOOKUP(U31,Feeds!$F$224:$AS$234,10,FALSE)","v":0},{"$f":"HLOOKUP(V31,Feeds!$F$224:$AS$234,10,FALSE)","v":0},{"$f":"HLOOKUP(W31,Feeds!$F$224:$AS$234,10,FALSE)","v":0},{"$f":"HLOOKUP(X31,Feeds!$F$224:$AS$234,10,FALSE)","v":0},{"$f":"HLOOKUP(Y31,Feeds!$F$224:$AS$234,10,FALSE)","v":0},{"$f":"HLOOKUP(Z31,Feeds!$F$224:$AS$234,10,FALSE)","v":0},{"$f":"HLOOKUP(AA31,Feeds!$F$224:$AS$234,10,FALSE)","v":0},{"$f":"HLOOKUP(AB31,Feeds!$F$224:$AS$234,10,FALSE)","v":0},{"$f":"HLOOKUP(AC31,Feeds!$F$224:$AS$234,10,FALSE)","v":0},{"$f":"HLOOKUP(AD31,Feeds!$F$224:$AS$234,10,FALSE)","v":0},{"$f":"HLOOKUP(AE31,Feeds!$F$224:$AS$234,10,FALSE)","v":0},{"$f":"HLOOKUP(AF31,Feeds!$F$224:$AS$234,10,FALSE)","v":0},{"$f":"HLOOKUP(AG31,Feeds!$F$224:$AS$234,10,FALSE)","v":0},{"$f":"HLOOKUP(AH31,Feeds!$F$224:$AS$234,10,FALSE)","v":0},{"$f":"HLOOKUP(AI31,Feeds!$F$224:$AS$234,10,FALSE)","v":0},{"$f":"HLOOKUP(AJ31,Feeds!$F$224:$AS$234,10,FALSE)","v":0},{"$f":"HLOOKUP(AK31,Feeds!$F$224:$AS$234,10,FALSE)","v":0},{"$f":"HLOOKUP(AL31,Feeds!$F$224:$AS$234,10,FALSE)","v":0},{"$f":"HLOOKUP(AM31,Feeds!$F$224:$AS$234,10,FALSE)","v":0},{"$f":"HLOOKUP(AN31,Feeds!$F$224:$AS$234,10,FALSE)","v":0},{"$f":"HLOOKUP(AO31,Feeds!$F$224:$AS$234,10,FALSE)","v":0},{"$f":"HLOOKUP(AP31,Feeds!$F$224:$AS$234,10,FALSE)","v":0},{"$f":"HLOOKUP(AQ31,Feeds!$F$224:$AS$234,10,FALSE)","v":0},{"$f":"HLOOKUP(AR31,Feeds!$F$224:$AS$234,10,FALSE)","v":0},{"$f":"HLOOKUP(AS31,Feeds!$F$224:$AS$234,10,FALSE)","v":0},{"$f":"HLOOKUP(AT31,Feeds!$F$224:$AS$234,10,FALSE)","v":0},{"$f":"HLOOKUP(AU31,Feeds!$F$224:$AS$234,10,FALSE)","v":0},{"$f":"HLOOKUP(AV31,Feeds!$F$224:$AS$234,10,FALSE)","v":0},{"$f":"HLOOKUP(AW31,Feeds!$F$224:$AS$234,10,FALSE)","v":0},{"$f":"HLOOKUP(AX31,Feeds!$F$224:$AS$234,10,FALSE)","v":0},{"$f":"HLOOKUP(AY31,Feeds!$F$224:$AS$234,10,FALSE)","v":0},{"$f":"HLOOKUP(AZ31,Feeds!$F$224:$AS$234,10,FALSE)","v":0},{"$f":"HLOOKUP(BA31,Feeds!$F$224:$AS$234,10,FALSE)","v":0},{"$f":"HLOOKUP(BB31,Feeds!$F$224:$AS$234,10,FALSE)","v":0},{"$f":"HLOOKUP(BC31,Feeds!$F$224:$AS$234,10,FALSE)","v":0},{"$f":"HLOOKUP(BD31,Feeds!$F$224:$AS$234,10,FALSE)","v":0},{"$f":"HLOOKUP(BE31,Feeds!$F$224:$AS$234,10,FALSE)","v":0}]
[null,null,null,null,"Gross Energy MJ",{"$f":"SUMPRODUCT(H38:O38,$H$95:$O$95)/SUM($H$95:$O$95)","v":16.396470247443229},{"$f":"HLOOKUP(G31,Feeds!$F$224:$AS$234,9,FALSE)","v":0},{"$f":"HLOOKUP(H31,Feeds!$F$224:$AS$234,9,FALSE)","v":15.995854999999997},{"$f":"HLOOKUP(I31,Feeds!$F$224:$AS$234,9,FALSE)","v":15.995854999999997},{"$f":"HLOOKUP(J31,Feeds!$F$224:$AS$234,9,FALSE)","v":15.995854999999997},{"$f":"HLOOKUP(K31,Feeds!$F$224:$AS$234,9,FALSE)","v":16.879028499999997},{"$f":"HLOOKUP(L31,Feeds!$F$224:$AS$234,9,FALSE)","v":16.863750999999997},{"$f":"HLOOKUP(M31,Feeds!$F$224:$AS$234,9,FALSE)","v":16.932723999999997},{"$f":"HLOOKUP(N31,Feeds!$F$224:$AS$234,9,FALSE)","v":16.428818499999998},{"$f":"HLOOKUP(O31,Feeds!$F$224:$AS$234,9,FALSE)","v":16.280421},{"$f":"HLOOKUP(P31,Feeds!$F$224:$AS$234,9,FALSE)","v":0},{"$f":"HLOOKUP(Q31,Feeds!$F$224:$AS$234,9,FALSE)","v":0},{"$f":"HLOOKUP(R31,Feeds!$F$224:$AS$234,9,FALSE)","v":0},{"$f":"HLOOKUP(S31,Feeds!$F$224:$AS$234,9,FALSE)","v":0},{"$f":"HLOOKUP(T31,Feeds!$F$224:$AS$234,9,FALSE)","v":0},{"$f":"HLOOKUP(U31,Feeds!$F$224:$AS$234,9,FALSE)","v":0},{"$f":"HLOOKUP(V31,Feeds!$F$224:$AS$234,9,FALSE)","v":0},{"$f":"HLOOKUP(W31,Feeds!$F$224:$AS$234,9,FALSE)","v":0},{"$f":"HLOOKUP(X31,Feeds!$F$224:$AS$234,9,FALSE)","v":0},{"$f":"HLOOKUP(Y31,Feeds!$F$224:$AS$234,9,FALSE)","v":0},{"$f":"HLOOKUP(Z31,Feeds!$F$224:$AS$234,9,FALSE)","v":0},{"$f":"HLOOKUP(AA31,Feeds!$F$224:$AS$234,9,FALSE)","v":0},{"$f":"HLOOKUP(AB31,Feeds!$F$224:$AS$234,9,FALSE)","v":0},{"$f":"HLOOKUP(AC31,Feeds!$F$224:$AS$234,9,FALSE)","v":0},{"$f":"HLOOKUP(AD31,Feeds!$F$224:$AS$234,9,FALSE)","v":0},{"$f":"HLOOKUP(AE31,Feeds!$F$224:$AS$234,9,FALSE)","v":0},{"$f":"HLOOKUP(AF31,Feeds!$F$224:$AS$234,9,FALSE)","v":0},{"$f":"HLOOKUP(AG31,Feeds!$F$224:$AS$234,9,FALSE)","v":0},{"$f":"HLOOKUP(AH31,Feeds!$F$224:$AS$234,9,FALSE)","v":0},{"$f":"HLOOKUP(AI31,Feeds!$F$224:$AS$234,9,FALSE)","v":0},{"$f":"HLOOKUP(AJ31,Feeds!$F$224:$AS$234,9,FALSE)","v":0},{"$f":"HLOOKUP(AK31,Feeds!$F$224:$AS$234,9,FALSE)","v":0},{"$f":"HLOOKUP(AL31,Feeds!$F$224:$AS$234,9,FALSE)","v":0},{"$f":"HLOOKUP(AM31,Feeds!$F$224:$AS$234,9,FALSE)","v":0},{"$f":"HLOOKUP(AN31,Feeds!$F$224:$AS$234,9,FALSE)","v":0},{"$f":"HLOOKUP(AO31,Feeds!$F$224:$AS$234,9,FALSE)","v":0},{"$f":"HLOOKUP(AP31,Feeds!$F$224:$AS$234,9,FALSE)","v":0},{"$f":"HLOOKUP(AQ31,Feeds!$F$224:$AS$234,9,FALSE)","v":0},{"$f":"HLOOKUP(AR31,Feeds!$F$224:$AS$234,9,FALSE)","v":0},{"$f":"HLOOKUP(AS31,Feeds!$F$224:$AS$234,9,FALSE)","v":0},{"$f":"HLOOKUP(AT31,Feeds!$F$224:$AS$234,9,FALSE)","v":0},{"$f":"HLOOKUP(AU31,Feeds!$F$224:$AS$234,9,FALSE)","v":0},{"$f":"HLOOKUP(AV31,Feeds!$F$224:$AS$234,9,FALSE)","v":0},{"$f":"HLOOKUP(AW31,Feeds!$F$224:$AS$234,9,FALSE)","v":0},{"$f":"HLOOKUP(AX31,Feeds!$F$224:$AS$234,9,FALSE)","v":0},{"$f":"HLOOKUP(AY31,Feeds!$F$224:$AS$234,9,FALSE)","v":0},{"$f":"HLOOKUP(AZ31,Feeds!$F$224:$AS$234,9,FALSE)","v":0},{"$f":"HLOOKUP(BA31,Feeds!$F$224:$AS$234,9,FALSE)","v":0},{"$f":"HLOOKUP(BB31,Feeds!$F$224:$AS$234,9,FALSE)","v":0},{"$f":"HLOOKUP(BC31,Feeds!$F$224:$AS$234,9,FALSE)","v":0},{"$f":"HLOOKUP(BD31,Feeds!$F$224:$AS$234,9,FALSE)","v":0},{"$f":"HLOOKUP(BE31,Feeds!$F$224:$AS$234,9,FALSE)","v":0}]
[null,null,null,"Manure"]
[null,null,null,null,"Fixed Solids %",null,{"$f":"HLOOKUP(G31,Feeds!$F$224:$AS$234,3,FALSE)","v":0},{"$f":"HLOOKUP(H31,Feeds!$F$224:$AS$234,3,FALSE)","v":4.5741724999999995},{"$f":"HLOOKUP(I31,Feeds!$F$224:$AS$234,3,FALSE)","v":4.5741724999999995},{"$f":"HLOOKUP(J31,Feeds!$F$224:$AS$234,3,FALSE)","v":4.5741724999999995},{"$f":"HLOOKUP(K31,Feeds!$F$224:$AS$234,3,FALSE)","v":4.3483875000000003},{"$f":"HLOOKUP(L31,Feeds!$F$224:$AS$234,3,FALSE)","v":5.3697400000000002},{"$f":"HLOOKUP(M31,Feeds!$F$224:$AS$234,3,FALSE)","v":4.5475400000000006},{"$f":"HLOOKUP(N31,Feeds!$F$224:$AS$234,3,FALSE)","v":4.5855565},{"$f":"HLOOKUP(O31,Feeds!$F$224:$AS$234,3,FALSE)","v":4.747395},{"$f":"HLOOKUP(P31,Feeds!$F$224:$AS$234,3,FALSE)","v":0},{"$f":"HLOOKUP(Q31,Feeds!$F$224:$AS$234,3,FALSE)","v":0},{"$f":"HLOOKUP(R31,Feeds!$F$224:$AS$234,3,FALSE)","v":0},{"$f":"HLOOKUP(S31,Feeds!$F$224:$AS$234,3,FALSE)","v":0},{"$f":"HLOOKUP(T31,Feeds!$F$224:$AS$234,3,FALSE)","v":0},{"$f":"HLOOKUP(U31,Feeds!$F$224:$AS$234,3,FALSE)","v":0},{"$f":"HLOOKUP(V31,Feeds!$F$224:$AS$234,3,FALSE)","v":0},{"$f":"HLOOKUP(W31,Feeds!$F$224:$AS$234,3,FALSE)","v":0},{"$f":"HLOOKUP(X31,Feeds!$F$224:$AS$234,3,FALSE)","v":0},{"$f":"HLOOKUP(Y31,Feeds!$F$224:$AS$234,3,FALSE)","v":0},{"$f":"HLOOKUP(Z31,Feeds!$F$224:$AS$234,3,FALSE)","v":0},{"$f":"HLOOKUP(AA31,Feeds!$F$224:$AS$234,3,FALSE)","v":0},{"$f":"HLOOKUP(AB31,Feeds!$F$224:$AS$234,3,FALSE)","v":0},{"$f":"HLOOKUP(AC31,Feeds!$F$224:$AS$234,3,FALSE)","v":0},{"$f":"HLOOKUP(AD31,Feeds!$F$224:$AS$234,3,FALSE)","v":0},{"$f":"HLOOKUP(AE31,Feeds!$F$224:$AS$234,3,FALSE)","v":0},{"$f":"HLOOKUP(AF31,Feeds!$F$224:$AS$234,3,FALSE)","v":0},{"$f":"HLOOKUP(AG31,Feeds!$F$224:$AS$234,3,FALSE)","v":0},{"$f":"HLOOKUP(AH31,Feeds!$F$224:$AS$234,3,FALSE)","v":0},{"$f":"HLOOKUP(AI31,Feeds!$F$224:$AS$234,3,FALSE)","v":0},{"$f":"HLOOKUP(AJ31,Feeds!$F$224:$AS$234,3,FALSE)","v":0},{"$f":"HLOOKUP(AK31,Feeds!$F$224:$AS$234,3,FALSE)","v":0},{"$f":"HLOOKUP(AL31,Feeds!$F$224:$AS$234,3,FALSE)","v":0},{"$f":"HLOOKUP(AM31,Feeds!$F$224:$AS$234,3,FALSE)","v":0},{"$f":"HLOOKUP(AN31,Feeds!$F$224:$AS$234,3,FALSE)","v":0},{"$f":"HLOOKUP(AO31,Feeds!$F$224:$AS$234,3,FALSE)","v":0},{"$f":"HLOOKUP(AP31,Feeds!$F$224:$AS$234,3,FALSE)","v":0},{"$f":"HLOOKUP(AQ31,Feeds!$F$224:$AS$234,3,FALSE)","v":0},{"$f":"HLOOKUP(AR31,Feeds!$F$224:$AS$234,3,FALSE)","v":0},{"$f":"HLOOKUP(AS31,Feeds!$F$224:$AS$234,3,FALSE)","v":0},{"$f":"HLOOKUP(AT31,Feeds!$F$224:$AS$234,3,FALSE)","v":0},{"$f":"HLOOKUP(AU31,Feeds!$F$224:$AS$234,3,FALSE)","v":0},{"$f":"HLOOKUP(AV31,Feeds!$F$224:$AS$234,3,FALSE)","v":0},{"$f":"HLOOKUP(AW31,Feeds!$F$224:$AS$234,3,FALSE)","v":0},{"$f":"HLOOKUP(AX31,Feeds!$F$224:$AS$234,3,FALSE)","v":0},{"$f":"HLOOKUP(AY31,Feeds!$F$224:$AS$234,3,FALSE)","v":0},{"$f":"HLOOKUP(AZ31,Feeds!$F$224:$AS$234,3,FALSE)","v":0},{"$f":"HLOOKUP(BA31,Feeds!$F$224:$AS$234,3,FALSE)","v":0},{"$f":"HLOOKUP(BB31,Feeds!$F$224:$AS$234,3,FALSE)","v":0},{"$f":"HLOOKUP(BC31,Feeds!$F$224:$AS$234,3,FALSE)","v":0},{"$f":"HLOOKUP(BD31,Feeds!$F$224:$AS$234,3,FALSE)","v":0},{"$f":"HLOOKUP(BE31,Feeds!$F$224:$AS$234,3,FALSE)","v":0}]
[null,null,null,null,"Fixed Solids Fed kg/day/pig",null,{"$f":"G40*G34/100","v":0},0.11444579594999998,{"$f":"I40*I34/100","v":0.10516022577499999},0.10516022577499999,0.23959615125,8.5915840000000009E-4,3.6016516800000009E-2,5.7778011900000002E-2,0.1239070095,0,0,0,0,0,0,0,0,0,0,0,0,0,0,0,0,0,0,0,0,0,0,0,0,{"$f":"AN40*AN34/100","v":0},0,0,0,0,0,0,0,0,0,0,0,0,0,0,0,0,0]
[null,null,null,null,"Fixed Solids Retained kg/day/pig",null,{"$f":"IF((G23-G22)<>0,((G25-G24)/(G23-G22))*Assumption!$H$41/1000,0)","v":0},{"$f":"IF((H23-H22)<>0,((H25-H24)/(H23-H22))*Assumption!$H$41/1000,0)","v":2.0714285714285716E-2},{"$f":"IF((I23-I22)<>0,((I25-I24)/(I23-I22))*Assumption!$H$41/1000,0)","v":3.1354700854700854E-3},{"$f":"IF((J23-J22)<>0,((J25-J24)/(J23-J22))*Assumption!$H$41/1000,0)","v":1.6133518776077886E-3},{"$f":"IF((K23-K22)<>0,((K25-K24)/(K23-K22))*Assumption!$H$41/1000,0)","v":0},{"$f":"IF((L23-L22)<>0,((L25-L24)/(L23-L22))*Assumption!$H$41/1000,0)","v":7.361538461538461E-3},{"$f":"IF((M23-M22)<>0,((M25-M24)/(M23-M22))*Assumption!$H$41/1000,0)","v":1.3488372093023254E-2},{"$f":"IF((N23-N22)<>0,((N25-N24)/(N23-N22))*Assumption!$H$41/1000,0)","v":1.6975609756097559E-2},{"$f":"IF((O23-O22)<>0,((O25-O24)/(O23-O22))*Assumption!$H$41/1000,0)","v":3.0414634146341463E-2},{"$f":"IF((P23-P22)<>0,((P25-P24)/(P23-P22))*Assumption!$H$41/1000,0)","v":0},{"$f":"IF((Q23-Q22)<>0,((Q25-Q24)/(Q23-Q22))*Assumption!$H$41/1000,0)","v":0},{"$f":"IF((R23-R22)<>0,((R25-R24)/(R23-R22))*Assumption!$H$41/1000,0)","v":0},{"$f":"IF((S23-S22)<>0,((S25-S24)/(S23-S22))*Assumption!$H$41/1000,0)","v":0},{"$f":"IF((T23-T22)<>0,((T25-T24)/(T23-T22))*Assumption!$H$41/1000,0)","v":0},{"$f":"IF((U23-U22)<>0,((U25-U24)/(U23-U22))*Assumption!$H$41/1000,0)","v":0},{"$f":"IF((V23-V22)<>0,((V25-V24)/(V23-V22))*Assumption!$H$41/1000,0)","v":0},{"$f":"IF((W23-W22)<>0,((W25-W24)/(W23-W22))*Assumption!$H$41/1000,0)","v":0},{"$f":"IF((X23-X22)<>0,((X25-X24)/(X23-X22))*Assumption!$H$41/1000,0)","v":0},{"$f":"IF((Y23-Y22)<>0,((Y25-Y24)/(Y23-Y22))*Assumption!$H$41/1000,0)","v":0},{"$f":"IF((Z23-Z22)<>0,((Z25-Z24)/(Z23-Z22))*Assumption!$H$41/1000,0)","v":0},{"$f":"IF((AA23-AA22)<>0,((AA25-AA24)/(AA23-AA22))*Assumption!$H$41/1000,0)","v":0},{"$f":"IF((AB23-AB22)<>0,((AB25-AB24)/(AB23-AB22))*Assumption!$H$41/1000,0)","v":0},{"$f":"IF((AC23-AC22)<>0,((AC25-AC24)/(AC23-AC22))*Assumption!$H$41/1000,0)","v":0},{"$f":"IF((AD23-AD22)<>0,((AD25-AD24)/(AD23-AD22))*Assumption!$H$41/1000,0)","v":0},{"$f":"IF((AE23-AE22)<>0,((AE25-AE24)/(AE23-AE22))*Assumption!$H$41/1000,0)","v":0},{"$f":"IF((AF23-AF22)<>0,((AF25-AF24)/(AF23-AF22))*Assumption!$H$41/1000,0)","v":0},{"$f":"IF((AG23-AG22)<>0,((AG25-AG24)/(AG23-AG22))*Assumption!$H$41/1000,0)","v":0},{"$f":"IF((AH23-AH22)<>0,((AH25-AH24)/(AH23-AH22))*Assumption!$H$41/1000,0)","v":0},{"$f":"IF((AI23-AI22)<>0,((AI25-AI24)/(AI23-AI22))*Assumption!$H$41/1000,0)","v":0},{"$f":"IF((AJ23-AJ22)<>0,((AJ25-AJ24)/(AJ23-AJ22))*Assumption!$H$41/1000,0)","v":0},{"$f":"IF((AK23-AK22)<>0,((AK25-AK24)/(AK23-AK22))*Assumption!$H$41/1000,0)","v":0},{"$f":"IF((AL23-AL22)<>0,((AL25-AL24)/(AL23-AL22))*Assumption!$H$41/1000,0)","v":0},{"$f":"IF((AM23-AM22)<>0,((AM25-AM24)/(AM23-AM22))*Assumption!$H$41/1000,0)","v":0},{"$f":"IF((AN23-AN22)<>0,((AN25-AN24)/(AN23-AN22))*Assumption!$H$41/1000,0)","v":0},{"$f":"IF((AO23-AO22)<>0,((AO25-AO24)/(AO23-AO22))*Assumption!$H$41/1000,0)","v":0},{"$f":"IF((AP23-AP22)<>0,((AP25-AP24)/(AP23-AP22))*Assumption!$H$41/1000,0)","v":0},{"$f":"IF((AQ23-AQ22)<>0,((AQ25-AQ24)/(AQ23-AQ22))*Assumption!$H$41/1000,0)","v":0},{"$f":"IF((AR23-AR22)<>0,((AR25-AR24)/(AR23-AR22))*Assumption!$H$41/1000,0)","v":0},{"$f":"IF((AS23-AS22)<>0,((AS25-AS24)/(AS23-AS22))*Assumption!$H$41/1000,0)","v":0},{"$f":"IF((AT23-AT22)<>0,((AT25-AT24)/(AT23-AT22))*Assumption!$H$41/1000,0)","v":0},{"$f":"IF((AU23-AU22)<>0,((AU25-AU24)/(AU23-AU22))*Assumption!$H$41/1000,0)","v":0},{"$f":"IF((AV23-AV22)<>0,((AV25-AV24)/(AV23-AV22))*Assumption!$H$41/1000,0)","v":0},{"$f":"IF((AW23-AW22)<>0,((AW25-AW24)/(AW23-AW22))*Assumption!$H$41/1000,0)","v":0},{"$f":"IF((AX23-AX22)<>0,((AX25-AX24)/(AX23-AX22))*Assumption!$H$41/1000,0)","v":0},{"$f":"IF((AY23-AY22)<>0,((AY25-AY24)/(AY23-AY22))*Assumption!$H$41/1000,0)","v":0},{"$f":"IF((AZ23-AZ22)<>0,((AZ25-AZ24)/(AZ23-AZ22))*Assumption!$H$41/1000,0)","v":0},{"$f":"IF((BA23-BA22)<>0,((BA25-BA24)/(BA23-BA22))*Assumption!$H$41/1000,0)","v":0},{"$f":"IF((BB23-BB22)<>0,((BB25-BB24)/(BB23-BB22))*Assumption!$H$41/1000,0)","v":0},{"$f":"IF((BC23-BC22)<>0,((BC25-BC24)/(BC23-BC22))*Assumption!$H$41/1000,0)","v":0},{"$f":"IF((BD23-BD22)<>0,((BD25-BD24)/(BD23-BD22))*Assumption!$H$41/1000,0)","v":0},{"$f":"IF((BE23-BE22)<>0,((BE25-BE24)/(BE23-BE22))*Assumption!$H$41/1000,0)","v":0}]
[null,null,null,null,"Fixed Solids Manure kg/day/pig",null,{"$f":"G41-G42","v":0},9.3731510235714272E-2,{"$f":"I41-I42","v":0.1020247556895299},{"$f":"J41-J42","v":0.1035468738973922},0.23959615125,-6.5023800615384613E-3,2.2528144706976755E-2,4.0802402143902447E-2,9.3492375353658536E-2,0,0,0,0,0,0,0,0,0,0,0,0,0,0,0,0,0,0,0,0,0,0,0,0,0,0,0,0,0,0,0,0,0,0,0,0,0,0,0,0,0,0]
[null,null,null,null,"Total Solids Manure %",null,{"$f":"HLOOKUP(G31,Feeds!$F$224:$AS$234,11,FALSE)","v":0},{"$f":"HLOOKUP(H31,Feeds!$F$224:$AS$234,11,FALSE)","v":17.417105410023389},{"$f":"HLOOKUP(I31,Feeds!$F$224:$AS$234,11,FALSE)","v":17.417105410023389},{"$f":"HLOOKUP(J31,Feeds!$F$224:$AS$234,11,FALSE)","v":17.417105410023389},{"$f":"HLOOKUP(K31,Feeds!$F$224:$AS$234,11,FALSE)","v":14.698641058024592},{"$f":"HLOOKUP(L31,Feeds!$F$224:$AS$234,11,FALSE)","v":10.306505519446148},{"$f":"HLOOKUP(M31,Feeds!$F$224:$AS$234,11,FALSE)","v":11.799491184718477},{"$f":"HLOOKUP(N31,Feeds!$F$224:$AS$234,11,FALSE)","v":12.431918438896915},{"$f":"HLOOKUP(O31,Feeds!$F$224:$AS$234,11,FALSE)","v":13.769424308772763},{"$f":"HLOOKUP(P31,Feeds!$F$224:$AS$234,11,FALSE)","v":0},{"$f":"HLOOKUP(Q31,Feeds!$F$224:$AS$234,11,FALSE)","v":0},{"$f":"HLOOKUP(R31,Feeds!$F$224:$AS$234,11,FALSE)","v":0},{"$f":"HLOOKUP(S31,Feeds!$F$224:$AS$234,11,FALSE)","v":0},{"$f":"HLOOKUP(T31,Feeds!$F$224:$AS$234,11,FALSE)","v":0},{"$f":"HLOOKUP(U31,Feeds!$F$224:$AS$234,11,FALSE)","v":0},{"$f":"HLOOKUP(V31,Feeds!$F$224:$AS$234,11,FALSE)","v":0},{"$f":"HLOOKUP(W31,Feeds!$F$224:$AS$234,11,FALSE)","v":0},{"$f":"HLOOKUP(X31,Feeds!$F$224:$AS$234,11,FALSE)","v":0},{"$f":"HLOOKUP(Y31,Feeds!$F$224:$AS$234,11,FALSE)","v":0},{"$f":"HLOOKUP(Z31,Feeds!$F$224:$AS$234,11,FALSE)","v":0},{"$f":"HLOOKUP(AA31,Feeds!$F$224:$AS$234,11,FALSE)","v":0},{"$f":"HLOOKUP(AB31,Feeds!$F$224:$AS$234,11,FALSE)","v":0},{"$f":"HLOOKUP(AC31,Feeds!$F$224:$AS$234,11,FALSE)","v":0},{"$f":"HLOOKUP(AD31,Feeds!$F$224:$AS$234,11,FALSE)","v":0},{"$f":"HLOOKUP(AE31,Feeds!$F$224:$AS$234,11,FALSE)","v":0},{"$f":"HLOOKUP(AF31,Feeds!$F$224:$AS$234,11,FALSE)","v":0},{"$f":"HLOOKUP(AG31,Feeds!$F$224:$AS$234,11,FALSE)","v":0},{"$f":"HLOOKUP(AH31,Feeds!$F$224:$AS$234,11,FALSE)","v":0},{"$f":"HLOOKUP(AI31,Feeds!$F$224:$AS$234,11,FALSE)","v":0},{"$f":"HLOOKUP(AJ31,Feeds!$F$224:$AS$234,11,FALSE)","v":0},{"$f":"HLOOKUP(AK31,Feeds!$F$224:$AS$234,11,FALSE)","v":0},{"$f":"HLOOKUP(AL31,Feeds!$F$224:$AS$234,11,FALSE)","v":0},{"$f":"HLOOKUP(AM31,Feeds!$F$224:$AS$234,11,FALSE)","v":0},{"$f":"HLOOKUP(AN31,Feeds!$F$224:$AS$234,11,FALSE)","v":0},{"$f":"HLOOKUP(AO31,Feeds!$F$224:$AS$234,11,FALSE)","v":0},{"$f":"HLOOKUP(AP31,Feeds!$F$224:$AS$234,11,FALSE)","v":0},{"$f":"HLOOKUP(AQ31,Feeds!$F$224:$AS$234,11,FALSE)","v":0},{"$f":"HLOOKUP(AR31,Feeds!$F$224:$AS$234,11,FALSE)","v":0},{"$f":"HLOOKUP(AS31,Feeds!$F$224:$AS$234,11,FALSE)","v":0},{"$f":"HLOOKUP(AT31,Feeds!$F$224:$AS$234,11,FALSE)","v":0},{"$f":"HLOOKUP(AU31,Feeds!$F$224:$AS$234,11,FALSE)","v":0},{"$f":"HLOOKUP(AV31,Feeds!$F$224:$AS$234,11,FALSE)","v":0},{"$f":"HLOOKUP(AW31,Feeds!$F$224:$AS$234,11,FALSE)","v":0},{"$f":"HLOOKUP(AX31,Feeds!$F$224:$AS$234,11,FALSE)","v":0},{"$f":"HLOOKUP(AY31,Feeds!$F$224:$AS$234,11,FALSE)","v":0},{"$f":"HLOOKUP(AZ31,Feeds!$F$224:$AS$234,11,FALSE)","v":0},{"$f":"HLOOKUP(BA31,Feeds!$F$224:$AS$234,11,FALSE)","v":0},{"$f":"HLOOKUP(BB31,Feeds!$F$224:$AS$234,11,FALSE)","v":0},{"$f":"HLOOKUP(BC31,Feeds!$F$224:$AS$234,11,FALSE)","v":0},{"$f":"HLOOKUP(BD31,Feeds!$F$224:$AS$234,11,FALSE)","v":0},{"$f":"HLOOKUP(BE31,Feeds!$F$224:$AS$234,11,FALSE)","v":0}]
[null,null,null,null,"Total Solids kg/day/pig",null,{"$f":"G44*G34/100","v":0},0.43577597735878515,{"$f":"I44*I34/100","v":0.40041925337643769},0.40041925337643769,0.80989512229715499,1.6490408831113838E-3,9.3451970182970343E-2,0.15664217233010114,0.35938197445896913,0,0,0,0,0,0,0,0,0,0,0,0,0,0,0,0,0,0,0,0,0,0,0,0,{"$f":"AN44*AN34/100","v":0},0,0,0,0,0,0,0,0,0,0,0,0,0,0,0,0,0]
[null,null,null,null,"Volatile Solids Manure kg/day/pig",null,{"$f":"G45-G43","v":0},0.34204446712307091,{"$f":"I45-I43","v":0.29839449768690779},{"$f":"J45-J43","v":0.29687237947904549},0.57029897104715499,8.1514209446498457E-3,7.0923825475993588E-2,0.11583977018619869,0.26588959910531063,0,0,0,0,0,0,0,0,0,0,0,0,0,0,0,0,0,0,0,0,0,0,0,0,0,0,0,0,0,0,0,0,0,0,0,0,0,0,0,0,0,0]
[null,null,null,null,"% N in Feed",null,{"$f":"HLOOKUP(G31,Feeds!$F$224:$AS$234,5,FALSE)","v":0},{"$f":"HLOOKUP(H31,Feeds!$F$224:$AS$234,5,FALSE)","v":2.3375632},{"$f":"HLOOKUP(I31,Feeds!$F$224:$AS$234,5,FALSE)","v":2.3375632},{"$f":"HLOOKUP(J31,Feeds!$F$224:$AS$234,5,FALSE)","v":2.3375632},{"$f":"HLOOKUP(K31,Feeds!$F$224:$AS$234,5,FALSE)","v":2.7633705600000003},{"$f":"HLOOKUP(L31,Feeds!$F$224:$AS$234,5,FALSE)","v":3.6336380799999994},{"$f":"HLOOKUP(M31,Feeds!$F$224:$AS$234,5,FALSE)","v":3.1741776000000006},{"$f":"HLOOKUP(N31,Feeds!$F$224:$AS$234,5,FALSE)","v":3.0705508799999999},{"$f":"HLOOKUP(O31,Feeds!$F$224:$AS$234,5,FALSE)","v":2.9313600000000006},{"$f":"HLOOKUP(P31,Feeds!$F$224:$AS$234,5,FALSE)","v":0},{"$f":"HLOOKUP(Q31,Feeds!$F$224:$AS$234,5,FALSE)","v":0},{"$f":"HLOOKUP(R31,Feeds!$F$224:$AS$234,5,FALSE)","v":0},{"$f":"HLOOKUP(S31,Feeds!$F$224:$AS$234,5,FALSE)","v":0},{"$f":"HLOOKUP(T31,Feeds!$F$224:$AS$234,5,FALSE)","v":0},{"$f":"HLOOKUP(U31,Feeds!$F$224:$AS$234,5,FALSE)","v":0},{"$f":"HLOOKUP(V31,Feeds!$F$224:$AS$234,5,FALSE)","v":0},{"$f":"HLOOKUP(W31,Feeds!$F$224:$AS$234,5,FALSE)","v":0},{"$f":"HLOOKUP(X31,Feeds!$F$224:$AS$234,5,FALSE)","v":0},{"$f":"HLOOKUP(Y31,Feeds!$F$224:$AS$234,5,FALSE)","v":0},{"$f":"HLOOKUP(Z31,Feeds!$F$224:$AS$234,5,FALSE)","v":0},{"$f":"HLOOKUP(AA31,Feeds!$F$224:$AS$234,5,FALSE)","v":0},{"$f":"HLOOKUP(AB31,Feeds!$F$224:$AS$234,5,FALSE)","v":0},{"$f":"HLOOKUP(AC31,Feeds!$F$224:$AS$234,5,FALSE)","v":0},{"$f":"HLOOKUP(AD31,Feeds!$F$224:$AS$234,5,FALSE)","v":0},{"$f":"HLOOKUP(AE31,Feeds!$F$224:$AS$234,5,FALSE)","v":0},{"$f":"HLOOKUP(AF31,Feeds!$F$224:$AS$234,5,FALSE)","v":0},{"$f":"HLOOKUP(AG31,Feeds!$F$224:$AS$234,5,FALSE)","v":0},{"$f":"HLOOKUP(AH31,Feeds!$F$224:$AS$234,5,FALSE)","v":0},{"$f":"HLOOKUP(AI31,Feeds!$F$224:$AS$234,5,FALSE)","v":0},{"$f":"HLOOKUP(AJ31,Feeds!$F$224:$AS$234,5,FALSE)","v":0},{"$f":"HLOOKUP(AK31,Feeds!$F$224:$AS$234,5,FALSE)","v":0},{"$f":"HLOOKUP(AL31,Feeds!$F$224:$AS$234,5,FALSE)","v":0},{"$f":"HLOOKUP(AM31,Feeds!$F$224:$AS$234,5,FALSE)","v":0},{"$f":"HLOOKUP(AN31,Feeds!$F$224:$AS$234,5,FALSE)","v":0},{"$f":"HLOOKUP(AO31,Feeds!$F$224:$AS$234,5,FALSE)","v":0},{"$f":"HLOOKUP(AP31,Feeds!$F$224:$AS$234,5,FALSE)","v":0},{"$f":"HLOOKUP(AQ31,Feeds!$F$224:$AS$234,5,FALSE)","v":0},{"$f":"HLOOKUP(AR31,Feeds!$F$224:$AS$234,5,FALSE)","v":0},{"$f":"HLOOKUP(AS31,Feeds!$F$224:$AS$234,5,FALSE)","v":0},{"$f":"HLOOKUP(AT31,Feeds!$F$224:$AS$234,5,FALSE)","v":0},{"$f":"HLOOKUP(AU31,Feeds!$F$224:$AS$234,5,FALSE)","v":0},{"$f":"HLOOKUP(AV31,Feeds!$F$224:$AS$234,5,FALSE)","v":0},{"$f":"HLOOKUP(AW31,Feeds!$F$224:$AS$234,5,FALSE)","v":0},{"$f":"HLOOKUP(AX31,Feeds!$F$224:$AS$234,5,FALSE)","v":0},{"$f":"HLOOKUP(AY31,Feeds!$F$224:$AS$234,5,FALSE)","v":0},{"$f":"HLOOKUP(AZ31,Feeds!$F$224:$AS$234,5,FALSE)","v":0},{"$f":"HLOOKUP(BA31,Feeds!$F$224:$AS$234,5,FALSE)","v":0},{"$f":"HLOOKUP(BB31,Feeds!$F$224:$AS$234,5,FALSE)","v":0},{"$f":"HLOOKUP(BC31,Feeds!$F$224:$AS$234,5,FALSE)","v":0},{"$f":"HLOOKUP(BD31,Feeds!$F$224:$AS$234,5,FALSE)","v":0},{"$f":"HLOOKUP(BE31,Feeds!$F$224:$AS$234,5,FALSE)","v":0}]
[null,null,null,null,"N Fed kg/day/pig",null,{"$f":"G47/100*G34","v":0},5.8485831263999997E-2,{"$f":"I47/100*I34","v":5.3740577967999997E-2},5.3740577967999997E-2,0.15226171785600001,5.8138209279999986E-4,2.5139486592000007E-2,3.8688941088000001E-2,7.6508496000000009E-2,0,0,0,0,0,0,0,0,0,0,0,0,0,0,0,0,0,0,0,0,0,0,0,0,{"$f":"AN47/100*AN34","v":0},0,0,0,0,0,0,0,0,0,0,0,0,0,0,0,0,0]
[null,null,null,null,"N Retained kg/day/pig",null,{"$f":"IF((G23-G22)<>0,((G25-G24)/(G23-G22))*Assumption!$D$41/1000,0)","v":0},{"$f":"IF((H23-H22)<>0,((H25-H24)/(H23-H22))*Assumption!$D$41/1000,0)","v":1.8285714285714287E-2},{"$f":"IF((I23-I22)<>0,((I25-I24)/(I23-I22))*Assumption!$D$41/1000,0)","v":2.7678632478632483E-3},{"$f":"IF((J23-J22)<>0,((J25-J24)/(J23-J22))*Assumption!$D$41/1000,0)","v":1.424200278164117E-3},{"$f":"IF((K23-K22)<>0,((K25-K24)/(K23-K22))*Assumption!$D$41/1000,0)","v":0},{"$f":"IF((L23-L22)<>0,((L25-L24)/(L23-L22))*Assumption!$D$41/1000,0)","v":6.498461538461538E-3},{"$f":"IF((M23-M22)<>0,((M25-M24)/(M23-M22))*Assumption!$D$41/1000,0)","v":1.1906976744186046E-2},{"$f":"IF((N23-N22)<>0,((N25-N24)/(N23-N22))*Assumption!$D$41/1000,0)","v":1.4985365853658535E-2},{"$f":"IF((O23-O22)<>0,((O25-O24)/(O23-O22))*Assumption!$D$41/1000,0)","v":2.6848780487804879E-2},{"$f":"IF((P23-P22)<>0,((P25-P24)/(P23-P22))*Assumption!$D$41/1000,0)","v":0},{"$f":"IF((Q23-Q22)<>0,((Q25-Q24)/(Q23-Q22))*Assumption!$D$41/1000,0)","v":0},{"$f":"IF((R23-R22)<>0,((R25-R24)/(R23-R22))*Assumption!$D$41/1000,0)","v":0},{"$f":"IF((S23-S22)<>0,((S25-S24)/(S23-S22))*Assumption!$D$41/1000,0)","v":0},{"$f":"IF((T23-T22)<>0,((T25-T24)/(T23-T22))*Assumption!$D$41/1000,0)","v":0},{"$f":"IF((U23-U22)<>0,((U25-U24)/(U23-U22))*Assumption!$D$41/1000,0)","v":0},{"$f":"IF((V23-V22)<>0,((V25-V24)/(V23-V22))*Assumption!$D$41/1000,0)","v":0},{"$f":"IF((W23-W22)<>0,((W25-W24)/(W23-W22))*Assumption!$D$41/1000,0)","v":0},{"$f":"IF((X23-X22)<>0,((X25-X24)/(X23-X22))*Assumption!$D$41/1000,0)","v":0},{"$f":"IF((Y23-Y22)<>0,((Y25-Y24)/(Y23-Y22))*Assumption!$D$41/1000,0)","v":0},{"$f":"IF((Z23-Z22)<>0,((Z25-Z24)/(Z23-Z22))*Assumption!$D$41/1000,0)","v":0},{"$f":"IF((AA23-AA22)<>0,((AA25-AA24)/(AA23-AA22))*Assumption!$D$41/1000,0)","v":0},{"$f":"IF((AB23-AB22)<>0,((AB25-AB24)/(AB23-AB22))*Assumption!$D$41/1000,0)","v":0},{"$f":"IF((AC23-AC22)<>0,((AC25-AC24)/(AC23-AC22))*Assumption!$D$41/1000,0)","v":0},{"$f":"IF((AD23-AD22)<>0,((AD25-AD24)/(AD23-AD22))*Assumption!$D$41/1000,0)","v":0},{"$f":"IF((AE23-AE22)<>0,((AE25-AE24)/(AE23-AE22))*Assumption!$D$41/1000,0)","v":0},{"$f":"IF((AF23-AF22)<>0,((AF25-AF24)/(AF23-AF22))*Assumption!$D$41/1000,0)","v":0},{"$f":"IF((AG23-AG22)<>0,((AG25-AG24)/(AG23-AG22))*Assumption!$D$41/1000,0)","v":0},{"$f":"IF((AH23-AH22)<>0,((AH25-AH24)/(AH23-AH22))*Assumption!$D$41/1000,0)","v":0},{"$f":"IF((AI23-AI22)<>0,((AI25-AI24)/(AI23-AI22))*Assumption!$D$41/1000,0)","v":0},{"$f":"IF((AJ23-AJ22)<>0,((AJ25-AJ24)/(AJ23-AJ22))*Assumption!$D$41/1000,0)","v":0},{"$f":"IF((AK23-AK22)<>0,((AK25-AK24)/(AK23-AK22))*Assumption!$D$41/1000,0)","v":0},{"$f":"IF((AL23-AL22)<>0,((AL25-AL24)/(AL23-AL22))*Assumption!$D$41/1000,0)","v":0},{"$f":"IF((AM23-AM22)<>0,((AM25-AM24)/(AM23-AM22))*Assumption!$D$41/1000,0)","v":0},{"$f":"IF((AN23-AN22)<>0,((AN25-AN24)/(AN23-AN22))*Assumption!$D$41/1000,0)","v":0},{"$f":"IF((AO23-AO22)<>0,((AO25-AO24)/(AO23-AO22))*Assumption!$D$41/1000,0)","v":0},{"$f":"IF((AP23-AP22)<>0,((AP25-AP24)/(AP23-AP22))*Assumption!$D$41/1000,0)","v":0},{"$f":"IF((AQ23-AQ22)<>0,((AQ25-AQ24)/(AQ23-AQ22))*Assumption!$D$41/1000,0)","v":0},{"$f":"IF((AR23-AR22)<>0,((AR25-AR24)/(AR23-AR22))*Assumption!$D$41/1000,0)","v":0},{"$f":"IF((AS23-AS22)<>0,((AS25-AS24)/(AS23-AS22))*Assumption!$D$41/1000,0)","v":0},{"$f":"IF((AT23-AT22)<>0,((AT25-AT24)/(AT23-AT22))*Assumption!$D$41/1000,0)","v":0},{"$f":"IF((AU23-AU22)<>0,((AU25-AU24)/(AU23-AU22))*Assumption!$D$41/1000,0)","v":0},{"$f":"IF((AV23-AV22)<>0,((AV25-AV24)/(AV23-AV22))*Assumption!$D$41/1000,0)","v":0},{"$f":"IF((AW23-AW22)<>0,((AW25-AW24)/(AW23-AW22))*Assumption!$D$41/1000,0)","v":0},{"$f":"IF((AX23-AX22)<>0,((AX25-AX24)/(AX23-AX22))*Assumption!$D$41/1000,0)","v":0},{"$f":"IF((AY23-AY22)<>0,((AY25-AY24)/(AY23-AY22))*Assumption!$D$41/1000,0)","v":0},{"$f":"IF((AZ23-AZ22)<>0,((AZ25-AZ24)/(AZ23-AZ22))*Assumption!$D$41/1000,0)","v":0},{"$f":"IF((BA23-BA22)<>0,((BA25-BA24)/(BA23-BA22))*Assumption!$D$41/1000,0)","v":0},{"$f":"IF((BB23-BB22)<>0,((BB25-BB24)/(BB23-BB22))*Assumption!$D$41/1000,0)","v":0},{"$f":"IF((BC23-BC22)<>0,((BC25-BC24)/(BC23-BC22))*Assumption!$D$41/1000,0)","v":0},{"$f":"IF((BD23-BD22)<>0,((BD25-BD24)/(BD23-BD22))*Assumption!$D$41/1000,0)","v":0},{"$f":"IF((BE23-BE22)<>0,((BE25-BE24)/(BE23-BE22))*Assumption!$D$41/1000,0)","v":0}]
[null,null,null,null,"N Manure kg/day/pig",null,{"$f":"G48-G49","v":0},4.020011697828571E-2,{"$f":"I48-I49","v":5.0972714720136751E-2},{"$f":"J48-J49","v":5.231637768983588E-2},0.15226171785600001,-5.9170794456615385E-3,1.3232509847813961E-2,2.3703575234341467E-2,4.9659715512195127E-2,0,0,0,0,0,0,0,0,0,0,0,0,0,0,0,0,0,0,0,0,0,0,0,0,0,0,0,0,0,0,0,0,0,0,0,0,0,0,0,0,0,0]
[null,null,null,"Watse Feed"]
[null,null,null,null,"kg/day/pig",null,{"$f":"G33-G34","v":0},0.27800000000000002,{"$f":"I33-I34","v":0.121},0.121,0.29000000000000004,4.0000000000000001E-3,8.7999999999999967E-2,0.1399999999999999,0.29000000000000004,0,0,0,0,0,0,0,0,0,0,0,0,0,0,0,0,0,0,0,0,0,0,0,0,{"$f":"AN33-AN34","v":0},0,0,0,0,0,0,0,0,0,0,0,0,0,0,0,0,0]
[null,null,null,null,"Volatile Solids %",null,{"$f":"HLOOKUP(G31,Feeds!$F$224:$AS$234,4,FALSE)","v":0},{"$f":"HLOOKUP(H31,Feeds!$F$224:$AS$234,4,FALSE)","v":83.80617749999999},{"$f":"HLOOKUP(I31,Feeds!$F$224:$AS$234,4,FALSE)","v":83.80617749999999},{"$f":"HLOOKUP(J31,Feeds!$F$224:$AS$234,4,FALSE)","v":83.80617749999999},{"$f":"HLOOKUP(K31,Feeds!$F$224:$AS$234,4,FALSE)","v":84.338012499999991},{"$f":"HLOOKUP(L31,Feeds!$F$224:$AS$234,4,FALSE)","v":83.902510000000007},{"$f":"HLOOKUP(M31,Feeds!$F$224:$AS$234,4,FALSE)","v":84.082210000000003},{"$f":"HLOOKUP(N31,Feeds!$F$224:$AS$234,4,FALSE)","v":83.879543499999983},{"$f":"HLOOKUP(O31,Feeds!$F$224:$AS$234,4,FALSE)","v":83.675555000000003},{"$f":"HLOOKUP(P31,Feeds!$F$224:$AS$234,4,FALSE)","v":0},{"$f":"HLOOKUP(Q31,Feeds!$F$224:$AS$234,4,FALSE)","v":0},{"$f":"HLOOKUP(R31,Feeds!$F$224:$AS$234,4,FALSE)","v":0},{"$f":"HLOOKUP(S31,Feeds!$F$224:$AS$234,4,FALSE)","v":0},{"$f":"HLOOKUP(T31,Feeds!$F$224:$AS$234,4,FALSE)","v":0},{"$f":"HLOOKUP(U31,Feeds!$F$224:$AS$234,4,FALSE)","v":0},{"$f":"HLOOKUP(V31,Feeds!$F$224:$AS$234,4,FALSE)","v":0},{"$f":"HLOOKUP(W31,Feeds!$F$224:$AS$234,4,FALSE)","v":0},{"$f":"HLOOKUP(X31,Feeds!$F$224:$AS$234,4,FALSE)","v":0},{"$f":"HLOOKUP(Y31,Feeds!$F$224:$AS$234,4,FALSE)","v":0},{"$f":"HLOOKUP(Z31,Feeds!$F$224:$AS$234,4,FALSE)","v":0},{"$f":"HLOOKUP(AA31,Feeds!$F$224:$AS$234,4,FALSE)","v":0},{"$f":"HLOOKUP(AB31,Feeds!$F$224:$AS$234,4,FALSE)","v":0},{"$f":"HLOOKUP(AC31,Feeds!$F$224:$AS$234,4,FALSE)","v":0},{"$f":"HLOOKUP(AD31,Feeds!$F$224:$AS$234,4,FALSE)","v":0},{"$f":"HLOOKUP(AE31,Feeds!$F$224:$AS$234,4,FALSE)","v":0},{"$f":"HLOOKUP(AF31,Feeds!$F$224:$AS$234,4,FALSE)","v":0},{"$f":"HLOOKUP(AG31,Feeds!$F$224:$AS$234,4,FALSE)","v":0},{"$f":"HLOOKUP(AH31,Feeds!$F$224:$AS$234,4,FALSE)","v":0},{"$f":"HLOOKUP(AI31,Feeds!$F$224:$AS$234,4,FALSE)","v":0},{"$f":"HLOOKUP(AJ31,Feeds!$F$224:$AS$234,4,FALSE)","v":0},{"$f":"HLOOKUP(AK31,Feeds!$F$224:$AS$234,4,FALSE)","v":0},{"$f":"HLOOKUP(AL31,Feeds!$F$224:$AS$234,4,FALSE)","v":0},{"$f":"HLOOKUP(AM31,Feeds!$F$224:$AS$234,4,FALSE)","v":0},{"$f":"HLOOKUP(AN31,Feeds!$F$224:$AS$234,4,FALSE)","v":0},{"$f":"HLOOKUP(AO31,Feeds!$F$224:$AS$234,4,FALSE)","v":0},{"$f":"HLOOKUP(AP31,Feeds!$F$224:$AS$234,4,FALSE)","v":0},{"$f":"HLOOKUP(AQ31,Feeds!$F$224:$AS$234,4,FALSE)","v":0},{"$f":"HLOOKUP(AR31,Feeds!$F$224:$AS$234,4,FALSE)","v":0},{"$f":"HLOOKUP(AS31,Feeds!$F$224:$AS$234,4,FALSE)","v":0},{"$f":"HLOOKUP(AT31,Feeds!$F$224:$AS$234,4,FALSE)","v":0},{"$f":"HLOOKUP(AU31,Feeds!$F$224:$AS$234,4,FALSE)","v":0},{"$f":"HLOOKUP(AV31,Feeds!$F$224:$AS$234,4,FALSE)","v":0},{"$f":"HLOOKUP(AW31,Feeds!$F$224:$AS$234,4,FALSE)","v":0},{"$f":"HLOOKUP(AX31,Feeds!$F$224:$AS$234,4,FALSE)","v":0},{"$f":"HLOOKUP(AY31,Feeds!$F$224:$AS$234,4,FALSE)","v":0},{"$f":"HLOOKUP(AZ31,Feeds!$F$224:$AS$234,4,FALSE)","v":0},{"$f":"HLOOKUP(BA31,Feeds!$F$224:$AS$234,4,FALSE)","v":0},{"$f":"HLOOKUP(BB31,Feeds!$F$224:$AS$234,4,FALSE)","v":0},{"$f":"HLOOKUP(BC31,Feeds!$F$224:$AS$234,4,FALSE)","v":0},{"$f":"HLOOKUP(BD31,Feeds!$F$224:$AS$234,4,FALSE)","v":0},{"$f":"HLOOKUP(BE31,Feeds!$F$224:$AS$234,4,FALSE)","v":0}]
[null,null,null,null,"Volatile solids kg/day/pi",null,{"$f":"G53/100*G52","v":0},0.23298117345,{"$f":"I53/100*I52","v":0.10140547477499999},{"$f":"J53/100*J52","v":0.10140547477499999},0.24458023625,3.3561004000000005E-3,7.3992344799999971E-2,0.11743136089999989,0.24265910950000003,0,0,0,0,0,0,0,0,0,0,0,0,0,0,0,0,0,0,0,0,0,0,0,0,0,0,0,0,0,0,0,0,0,0,0,0,0,0,0,0,0,0]
[null,null,null,null,"% N in feed",null,{"$f":"G47","v":0},2.3375632,{"$f":"I47","v":2.3375632},{"$f":"J47","v":2.3375632},2.7633705600000003,3.6336380799999994,3.1741776000000006,3.0705508799999999,2.9313600000000006,0,0,0,0,0,0,0,0,0,0,0,0,0,0,0,0,0,0,0,0,0,0,0,0,0,0,0,0,0,0,0,0,0,0,0,0,0,0,0,0,0,0]
[null,null,null,null,"N kg/day/pig",null,{"$f":"G55/100*G52","v":0},6.4984256960000011E-3,{"$f":"I55/100*I52","v":2.8284514719999999E-3},{"$f":"J55/100*J52","v":2.8284514719999999E-3},8.0137746240000023E-3,1.4534552319999997E-4,2.7932762879999996E-3,4.2987712319999972E-3,8.5009440000000033E-3,0,0,0,0,0,0,0,0,0,0,0,0,0,0,0,0,0,0,0,0,0,0,0,0,0,0,0,0,0,0,0,0,0,0,0,0,0,0,0,0,0,0]
[null,null,null,"Total Waste"]
[null,null,null,null,"Volatile Solids kg/day/pig",null,{"$f":"G46+G54","v":0},0.57502564057307093,{"$f":"I46+I54","v":0.39979997246190779},{"$f":"J46+J54","v":0.39827785425404549},0.81487920729715502,1.1507521344649847E-2,0.14491617027599357,0.23327113108619857,0.50854870860531065,{"$f":"P46+P54","v":0},0,0,0,0,0,0,0,0,0,0,0,0,0,0,0,0,0,0,0,0,0,0,0,0,0,0,0,0,0,0,0,0,0,0,0,0,0,0,0,0,0]
[null,null,null,null,"Volatile Solids kg/year",null,{"$f":"G58*365.25*G19","v":0},10501.405760965707,{"$f":"I58*365.25*I19","v":6133.1314775518968},122632.04142248257,46728.636983049881,6292.0738901866353,121475.79858863876,183355.30791411162,397499.46985071199,{"$f":"P58*365.25*P19","v":0},0,0,0,0,0,0,0,0,0,0,0,0,0,0,0,0,0,0,0,0,0,0,0,{"$f":"AN58*365.25*AN19","v":0},0,0,0,0,0,0,0,0,0,0,0,0,0,0,0,0,0]
[null,null,null,null,"N kg/day/pig",null,{"$f":"G50+G56","v":0},4.6698542674285713E-2,{"$f":"I50+I56","v":5.3801166192136748E-2},{"$f":"J50+J56","v":5.5144829161835877E-2},0.16027549248,-5.7717339224615388E-3,1.6025786135813961E-2,2.8002346466341463E-2,5.816065951219513E-2,{"$f":"P50+P56","v":0},0,0,0,0,0,0,0,0,0,0,0,0,0,0,0,0,0,0,0,0,0,0,0,0,0,0,0,0,0,0,0,0,0,0,0,0,0,0,0,0,0]
[null,null,null,null,"N kg/year",null,{"$f":"G60*365.25*G19","v":0},852.83213558914281,{"$f":"I60*365.25*I19","v":825.33678997047377},16979.409981696946,9190.8779096462404,-3155.8643453230784,13433.595196113381,22010.348364780784,45460.407097814641,{"$f":"P60*365.25*P19","v":0},0,0,0,0,0,0,0,0,0,0,0,0,0,0,0,0,0,0,0,0,0,0,0,{"$f":"AN60*365.25*AN19","v":0},0,0,0,0,0,0,0,0,0,0,0,0,0,0,0,0,0]
[null,null,null,"Waste Mangement"]
[null,null,null,null,"Maure Mangement System",null,{"$f":"G20","v":0},"Ponds I",{"$f":"I20","v":"Ponds I"},"Ponds I","Ponds I","Ponds I","Straw Igloo","Ponds I","Ponds I",0,0,0,0,0,0,0,0,0,0,0,0,0,0,0,0,0,0,0,0,0,0,0,0,{"$f":"AN20","v":0},0,0,0,0,0,0,0,0,0,0,0,0,0,0,0,0,0]
[null,null,null,null,"CO2-e/kg VS",null,{"$f":"IF(G20<>0,VLOOKUP(G20,MMSSum!$S$8:$V$12,3,FALSE),0)","v":0},{"$f":"IF(H20<>0,VLOOKUP(H20,MMSSum!$S$8:$V$12,3,FALSE),0)","v":4.7998392750000001},{"$f":"IF(I20<>0,VLOOKUP(I20,MMSSum!$S$8:$V$12,3,FALSE),0)","v":4.7998392750000001},{"$f":"IF(J20<>0,VLOOKUP(J20,MMSSum!$S$8:$V$12,3,FALSE),0)","v":4.7998392750000001},{"$f":"IF(K20<>0,VLOOKUP(K20,MMSSum!$S$8:$V$12,3,FALSE),0)","v":4.7998392750000001},{"$f":"IF(L20<>0,VLOOKUP(L20,MMSSum!$S$8:$V$12,3,FALSE),0)","v":4.7998392750000001},{"$f":"IF(M20<>0,VLOOKUP(M20,MMSSum!$S$8:$V$12,3,FALSE),0)","v":9.3838500000000005E-2},{"$f":"IF(N20<>0,VLOOKUP(N20,MMSSum!$S$8:$V$12,3,FALSE),0)","v":4.7998392750000001},{"$f":"IF(O20<>0,VLOOKUP(O20,MMSSum!$S$8:$V$12,3,FALSE),0)","v":4.7998392750000001},{"$f":"IF(P20<>0,VLOOKUP(P20,MMSSum!$S$8:$V$12,3,FALSE),0)","v":0},{"$f":"IF(Q20<>0,VLOOKUP(Q20,MMSSum!$S$8:$V$12,3,FALSE),0)","v":0},{"$f":"IF(R20<>0,VLOOKUP(R20,MMSSum!$S$8:$V$12,3,FALSE),0)","v":0},{"$f":"IF(S20<>0,VLOOKUP(S20,MMSSum!$S$8:$V$12,3,FALSE),0)","v":0},{"$f":"IF(T20<>0,VLOOKUP(T20,MMSSum!$S$8:$V$12,3,FALSE),0)","v":0},{"$f":"IF(U20<>0,VLOOKUP(U20,MMSSum!$S$8:$V$12,3,FALSE),0)","v":0},{"$f":"IF(V20<>0,VLOOKUP(V20,MMSSum!$S$8:$V$12,3,FALSE),0)","v":0},{"$f":"IF(W20<>0,VLOOKUP(W20,MMSSum!$S$8:$V$12,3,FALSE),0)","v":0},{"$f":"IF(X20<>0,VLOOKUP(X20,MMSSum!$S$8:$V$12,3,FALSE),0)","v":0},{"$f":"IF(Y20<>0,VLOOKUP(Y20,MMSSum!$S$8:$V$12,3,FALSE),0)","v":0},{"$f":"IF(Z20<>0,VLOOKUP(Z20,MMSSum!$S$8:$V$12,3,FALSE),0)","v":0},{"$f":"IF(AA20<>0,VLOOKUP(AA20,MMSSum!$S$8:$V$12,3,FALSE),0)","v":0},{"$f":"IF(AB20<>0,VLOOKUP(AB20,MMSSum!$S$8:$V$12,3,FALSE),0)","v":0},{"$f":"IF(AC20<>0,VLOOKUP(AC20,MMSSum!$S$8:$V$12,3,FALSE),0)","v":0},{"$f":"IF(AD20<>0,VLOOKUP(AD20,MMSSum!$S$8:$V$12,3,FALSE),0)","v":0},{"$f":"IF(AE20<>0,VLOOKUP(AE20,MMSSum!$S$8:$V$12,3,FALSE),0)","v":0},{"$f":"IF(AF20<>0,VLOOKUP(AF20,MMSSum!$S$8:$V$12,3,FALSE),0)","v":0},{"$f":"IF(AG20<>0,VLOOKUP(AG20,MMSSum!$S$8:$V$12,3,FALSE),0)","v":0},{"$f":"IF(AH20<>0,VLOOKUP(AH20,MMSSum!$S$8:$V$12,3,FALSE),0)","v":0},{"$f":"IF(AI20<>0,VLOOKUP(AI20,MMSSum!$S$8:$V$12,3,FALSE),0)","v":0},{"$f":"IF(AJ20<>0,VLOOKUP(AJ20,MMSSum!$S$8:$V$12,3,FALSE),0)","v":0},{"$f":"IF(AK20<>0,VLOOKUP(AK20,MMSSum!$S$8:$V$12,3,FALSE),0)","v":0},{"$f":"IF(AL20<>0,VLOOKUP(AL20,MMSSum!$S$8:$V$12,3,FALSE),0)","v":0},{"$f":"IF(AM20<>0,VLOOKUP(AM20,MMSSum!$S$8:$V$12,3,FALSE),0)","v":0},{"$f":"IF(AN20<>0,VLOOKUP(AN20,MMSSum!$S$8:$V$12,3,FALSE),0)","v":0},{"$f":"IF(AO20<>0,VLOOKUP(AO20,MMSSum!$S$8:$V$12,3,FALSE),0)","v":0},{"$f":"IF(AP20<>0,VLOOKUP(AP20,MMSSum!$S$8:$V$12,3,FALSE),0)","v":0},{"$f":"IF(AQ20<>0,VLOOKUP(AQ20,MMSSum!$S$8:$V$12,3,FALSE),0)","v":0},{"$f":"IF(AR20<>0,VLOOKUP(AR20,MMSSum!$S$8:$V$12,3,FALSE),0)","v":0},{"$f":"IF(AS20<>0,VLOOKUP(AS20,MMSSum!$S$8:$V$12,3,FALSE),0)","v":0},{"$f":"IF(AT20<>0,VLOOKUP(AT20,MMSSum!$S$8:$V$12,3,FALSE),0)","v":0},{"$f":"IF(AU20<>0,VLOOKUP(AU20,MMSSum!$S$8:$V$12,3,FALSE),0)","v":0},{"$f":"IF(AV20<>0,VLOOKUP(AV20,MMSSum!$S$8:$V$12,3,FALSE),0)","v":0},{"$f":"IF(AW20<>0,VLOOKUP(AW20,MMSSum!$S$8:$V$12,3,FALSE),0)","v":0},{"$f":"IF(AX20<>0,VLOOKUP(AX20,MMSSum!$S$8:$V$12,3,FALSE),0)","v":0},{"$f":"IF(AY20<>0,VLOOKUP(AY20,MMSSum!$S$8:$V$12,3,FALSE),0)","v":0},{"$f":"IF(AZ20<>0,VLOOKUP(AZ20,MMSSum!$S$8:$V$12,3,FALSE),0)","v":0},{"$f":"IF(BA20<>0,VLOOKUP(BA20,MMSSum!$S$8:$V$12,3,FALSE),0)","v":0},{"$f":"IF(BB20<>0,VLOOKUP(BB20,MMSSum!$S$8:$V$12,3,FALSE),0)","v":0},{"$f":"IF(BC20<>0,VLOOKUP(BC20,MMSSum!$S$8:$V$12,3,FALSE),0)","v":0},{"$f":"IF(BD20<>0,VLOOKUP(BD20,MMSSum!$S$8:$V$12,3,FALSE),0)","v":0},{"$f":"IF(BE20<>0,VLOOKUP(BE20,MMSSum!$S$8:$V$12,3,FALSE),0)","v":0}]
[null,null,null,null,"Total CO2-e kg from VS",{"$f":"SUM(H65:BE65)","v":3722356.7665025825},{"$f":"G64*G59","v":0},50405.059814194465,{"$f":"I64*I59","v":29438.045344692375},588614.08879305865,224289.94705846033,30200.943379319848,11399.10672585998,880076.00820587133,1907933.5671811257,{"$f":"P64*P59","v":0},0,0,0,0,0,0,0,0,0,0,0,0,0,0,0,0,0,0,0,0,0,0,0,0,0,0,0,0,0,0,0,0,0,0,0,0,0,0,0,0,0]
[null,null,null,null,"N2O Direct  CO2-e/kg N",null,{"$f":"IF(G20<>0,VLOOKUP(G20,MMSSum!$S$8:$X$12,4,FALSE),0)","v":0},{"$f":"IF(H20<>0,VLOOKUP(H20,MMSSum!$S$8:$X$12,4,FALSE),0)","v":0.94992857142857146},{"$f":"IF(I20<>0,VLOOKUP(I20,MMSSum!$S$8:$X$12,4,FALSE),0)","v":0.94992857142857146},{"$f":"IF(J20<>0,VLOOKUP(J20,MMSSum!$S$8:$X$12,4,FALSE),0)","v":0.94992857142857146},{"$f":"IF(K20<>0,VLOOKUP(K20,MMSSum!$S$8:$X$12,4,FALSE),0)","v":0.94992857142857146},{"$f":"IF(L20<>0,VLOOKUP(L20,MMSSum!$S$8:$X$12,4,FALSE),0)","v":0.94992857142857146},{"$f":"IF(M20<>0,VLOOKUP(M20,MMSSum!$S$8:$X$12,4,FALSE),0)","v":9.7428571428571438},{"$f":"IF(N20<>0,VLOOKUP(N20,MMSSum!$S$8:$X$12,4,FALSE),0)","v":0.94992857142857146},{"$f":"IF(O20<>0,VLOOKUP(O20,MMSSum!$S$8:$X$12,4,FALSE),0)","v":0.94992857142857146},{"$f":"IF(P20<>0,VLOOKUP(P20,MMSSum!$S$8:$X$12,4,FALSE),0)","v":0},{"$f":"IF(Q20<>0,VLOOKUP(Q20,MMSSum!$S$8:$X$12,4,FALSE),0)","v":0},{"$f":"IF(R20<>0,VLOOKUP(R20,MMSSum!$S$8:$X$12,4,FALSE),0)","v":0},{"$f":"IF(S20<>0,VLOOKUP(S20,MMSSum!$S$8:$X$12,4,FALSE),0)","v":0},{"$f":"IF(T20<>0,VLOOKUP(T20,MMSSum!$S$8:$X$12,4,FALSE),0)","v":0},{"$f":"IF(U20<>0,VLOOKUP(U20,MMSSum!$S$8:$X$12,4,FALSE),0)","v":0},{"$f":"IF(V20<>0,VLOOKUP(V20,MMSSum!$S$8:$X$12,4,FALSE),0)","v":0},{"$f":"IF(W20<>0,VLOOKUP(W20,MMSSum!$S$8:$X$12,4,FALSE),0)","v":0},{"$f":"IF(X20<>0,VLOOKUP(X20,MMSSum!$S$8:$X$12,4,FALSE),0)","v":0},{"$f":"IF(Y20<>0,VLOOKUP(Y20,MMSSum!$S$8:$X$12,4,FALSE),0)","v":0},{"$f":"IF(Z20<>0,VLOOKUP(Z20,MMSSum!$S$8:$X$12,4,FALSE),0)","v":0},{"$f":"IF(AA20<>0,VLOOKUP(AA20,MMSSum!$S$8:$X$12,4,FALSE),0)","v":0},{"$f":"IF(AB20<>0,VLOOKUP(AB20,MMSSum!$S$8:$X$12,4,FALSE),0)","v":0},{"$f":"IF(AC20<>0,VLOOKUP(AC20,MMSSum!$S$8:$X$12,4,FALSE),0)","v":0},{"$f":"IF(AD20<>0,VLOOKUP(AD20,MMSSum!$S$8:$X$12,4,FALSE),0)","v":0},{"$f":"IF(AE20<>0,VLOOKUP(AE20,MMSSum!$S$8:$X$12,4,FALSE),0)","v":0},{"$f":"IF(AF20<>0,VLOOKUP(AF20,MMSSum!$S$8:$X$12,4,FALSE),0)","v":0},{"$f":"IF(AG20<>0,VLOOKUP(AG20,MMSSum!$S$8:$X$12,4,FALSE),0)","v":0},{"$f":"IF(AH20<>0,VLOOKUP(AH20,MMSSum!$S$8:$X$12,4,FALSE),0)","v":0},{"$f":"IF(AI20<>0,VLOOKUP(AI20,MMSSum!$S$8:$X$12,4,FALSE),0)","v":0},{"$f":"IF(AJ20<>0,VLOOKUP(AJ20,MMSSum!$S$8:$X$12,4,FALSE),0)","v":0},{"$f":"IF(AK20<>0,VLOOKUP(AK20,MMSSum!$S$8:$X$12,4,FALSE),0)","v":0},{"$f":"IF(AL20<>0,VLOOKUP(AL20,MMSSum!$S$8:$X$12,4,FALSE),0)","v":0},{"$f":"IF(AM20<>0,VLOOKUP(AM20,MMSSum!$S$8:$X$12,4,FALSE),0)","v":0},{"$f":"IF(AN20<>0,VLOOKUP(AN20,MMSSum!$S$8:$X$12,4,FALSE),0)","v":0},{"$f":"IF(AO20<>0,VLOOKUP(AO20,MMSSum!$S$8:$X$12,4,FALSE),0)","v":0},{"$f":"IF(AP20<>0,VLOOKUP(AP20,MMSSum!$S$8:$X$12,4,FALSE),0)","v":0},{"$f":"IF(AQ20<>0,VLOOKUP(AQ20,MMSSum!$S$8:$X$12,4,FALSE),0)","v":0},{"$f":"IF(AR20<>0,VLOOKUP(AR20,MMSSum!$S$8:$X$12,4,FALSE),0)","v":0},{"$f":"IF(AS20<>0,VLOOKUP(AS20,MMSSum!$S$8:$X$12,4,FALSE),0)","v":0},{"$f":"IF(AT20<>0,VLOOKUP(AT20,MMSSum!$S$8:$X$12,4,FALSE),0)","v":0},{"$f":"IF(AU20<>0,VLOOKUP(AU20,MMSSum!$S$8:$X$12,4,FALSE),0)","v":0},{"$f":"IF(AV20<>0,VLOOKUP(AV20,MMSSum!$S$8:$X$12,4,FALSE),0)","v":0},{"$f":"IF(AW20<>0,VLOOKUP(AW20,MMSSum!$S$8:$X$12,4,FALSE),0)","v":0},{"$f":"IF(AX20<>0,VLOOKUP(AX20,MMSSum!$S$8:$X$12,4,FALSE),0)","v":0},{"$f":"IF(AY20<>0,VLOOKUP(AY20,MMSSum!$S$8:$X$12,4,FALSE),0)","v":0},{"$f":"IF(AZ20<>0,VLOOKUP(AZ20,MMSSum!$S$8:$X$12,4,FALSE),0)","v":0},{"$f":"IF(BA20<>0,VLOOKUP(BA20,MMSSum!$S$8:$X$12,4,FALSE),0)","v":0},{"$f":"IF(BB20<>0,VLOOKUP(BB20,MMSSum!$S$8:$X$12,4,FALSE),0)","v":0},{"$f":"IF(BC20<>0,VLOOKUP(BC20,MMSSum!$S$8:$X$12,4,FALSE),0)","v":0},{"$f":"IF(BD20<>0,VLOOKUP(BD20,MMSSum!$S$8:$X$12,4,FALSE),0)","v":0},{"$f":"IF(BE20<>0,VLOOKUP(BE20,MMSSum!$S$8:$X$12,4,FALSE),0)","v":0}]
[null,null,null,null,"CO2-e/kg N from N2O Direct",{"$f":"SUM(H67:BE67)","v":218430.19635189004},{"$f":"G66*G$61","v":0},810.12961222857223,{"$f":"I66*I$61","v":784.01099784409507},16129.226667613408,8730.6775228846673,-2997.8457091751156,130881.59891070468,20908.258778801403,43184.139570988351,{"$f":"P66*P$61","v":0},0,0,0,0,0,0,0,0,0,0,0,0,0,0,0,0,0,0,0,0,0,0,0,0,0,0,0,0,0,0,0,0,0,0,0,0,0,0,0,0,0]
[null,null,null,null,"N2O Vol. CO2-e/kg N",null,{"$f":"IF(G20<>0,VLOOKUP(G20,MMSSum!$S$8:$X$12,5,FALSE),0)","v":0},{"$f":"IF(H20<>0,VLOOKUP(H20,MMSSum!$S$8:$X$12,5,FALSE),0)","v":1.9607499999999998},{"$f":"IF(I20<>0,VLOOKUP(I20,MMSSum!$S$8:$X$12,5,FALSE),0)","v":1.9607499999999998},{"$f":"IF(J20<>0,VLOOKUP(J20,MMSSum!$S$8:$X$12,5,FALSE),0)","v":1.9607499999999998},{"$f":"IF(K20<>0,VLOOKUP(K20,MMSSum!$S$8:$X$12,5,FALSE),0)","v":1.9607499999999998},{"$f":"IF(L20<>0,VLOOKUP(L20,MMSSum!$S$8:$X$12,5,FALSE),0)","v":1.9607499999999998},{"$f":"IF(M20<>0,VLOOKUP(M20,MMSSum!$S$8:$X$12,5,FALSE),0)","v":2.1921428571428572},{"$f":"IF(N20<>0,VLOOKUP(N20,MMSSum!$S$8:$X$12,5,FALSE),0)","v":1.9607499999999998},{"$f":"IF(O20<>0,VLOOKUP(O20,MMSSum!$S$8:$X$12,5,FALSE),0)","v":1.9607499999999998},{"$f":"IF(P20<>0,VLOOKUP(P20,MMSSum!$S$8:$X$12,5,FALSE),0)","v":0},{"$f":"IF(Q20<>0,VLOOKUP(Q20,MMSSum!$S$8:$X$12,5,FALSE),0)","v":0},{"$f":"IF(R20<>0,VLOOKUP(R20,MMSSum!$S$8:$X$12,5,FALSE),0)","v":0},{"$f":"IF(S20<>0,VLOOKUP(S20,MMSSum!$S$8:$X$12,5,FALSE),0)","v":0},{"$f":"IF(T20<>0,VLOOKUP(T20,MMSSum!$S$8:$X$12,5,FALSE),0)","v":0},{"$f":"IF(U20<>0,VLOOKUP(U20,MMSSum!$S$8:$X$12,5,FALSE),0)","v":0},{"$f":"IF(V20<>0,VLOOKUP(V20,MMSSum!$S$8:$X$12,5,FALSE),0)","v":0},{"$f":"IF(W20<>0,VLOOKUP(W20,MMSSum!$S$8:$X$12,5,FALSE),0)","v":0},{"$f":"IF(X20<>0,VLOOKUP(X20,MMSSum!$S$8:$X$12,5,FALSE),0)","v":0},{"$f":"IF(Y20<>0,VLOOKUP(Y20,MMSSum!$S$8:$X$12,5,FALSE),0)","v":0},{"$f":"IF(Z20<>0,VLOOKUP(Z20,MMSSum!$S$8:$X$12,5,FALSE),0)","v":0},{"$f":"IF(AA20<>0,VLOOKUP(AA20,MMSSum!$S$8:$X$12,5,FALSE),0)","v":0},{"$f":"IF(AB20<>0,VLOOKUP(AB20,MMSSum!$S$8:$X$12,5,FALSE),0)","v":0},{"$f":"IF(AC20<>0,VLOOKUP(AC20,MMSSum!$S$8:$X$12,5,FALSE),0)","v":0},{"$f":"IF(AD20<>0,VLOOKUP(AD20,MMSSum!$S$8:$X$12,5,FALSE),0)","v":0},{"$f":"IF(AE20<>0,VLOOKUP(AE20,MMSSum!$S$8:$X$12,5,FALSE),0)","v":0},{"$f":"IF(AF20<>0,VLOOKUP(AF20,MMSSum!$S$8:$X$12,5,FALSE),0)","v":0},{"$f":"IF(AG20<>0,VLOOKUP(AG20,MMSSum!$S$8:$X$12,5,FALSE),0)","v":0},{"$f":"IF(AH20<>0,VLOOKUP(AH20,MMSSum!$S$8:$X$12,5,FALSE),0)","v":0},{"$f":"IF(AI20<>0,VLOOKUP(AI20,MMSSum!$S$8:$X$12,5,FALSE),0)","v":0},{"$f":"IF(AJ20<>0,VLOOKUP(AJ20,MMSSum!$S$8:$X$12,5,FALSE),0)","v":0},{"$f":"IF(AK20<>0,VLOOKUP(AK20,MMSSum!$S$8:$X$12,5,FALSE),0)","v":0},{"$f":"IF(AL20<>0,VLOOKUP(AL20,MMSSum!$S$8:$X$12,5,FALSE),0)","v":0},{"$f":"IF(AM20<>0,VLOOKUP(AM20,MMSSum!$S$8:$X$12,5,FALSE),0)","v":0},{"$f":"IF(AN20<>0,VLOOKUP(AN20,MMSSum!$S$8:$X$12,5,FALSE),0)","v":0},{"$f":"IF(AO20<>0,VLOOKUP(AO20,MMSSum!$S$8:$X$12,5,FALSE),0)","v":0},{"$f":"IF(AP20<>0,VLOOKUP(AP20,MMSSum!$S$8:$X$12,5,FALSE),0)","v":0},{"$f":"IF(AQ20<>0,VLOOKUP(AQ20,MMSSum!$S$8:$X$12,5,FALSE),0)","v":0},{"$f":"IF(AR20<>0,VLOOKUP(AR20,MMSSum!$S$8:$X$12,5,FALSE),0)","v":0},{"$f":"IF(AS20<>0,VLOOKUP(AS20,MMSSum!$S$8:$X$12,5,FALSE),0)","v":0},{"$f":"IF(AT20<>0,VLOOKUP(AT20,MMSSum!$S$8:$X$12,5,FALSE),0)","v":0},{"$f":"IF(AU20<>0,VLOOKUP(AU20,MMSSum!$S$8:$X$12,5,FALSE),0)","v":0},{"$f":"IF(AV20<>0,VLOOKUP(AV20,MMSSum!$S$8:$X$12,5,FALSE),0)","v":0},{"$f":"IF(AW20<>0,VLOOKUP(AW20,MMSSum!$S$8:$X$12,5,FALSE),0)","v":0},{"$f":"IF(AX20<>0,VLOOKUP(AX20,MMSSum!$S$8:$X$12,5,FALSE),0)","v":0},{"$f":"IF(AY20<>0,VLOOKUP(AY20,MMSSum!$S$8:$X$12,5,FALSE),0)","v":0},{"$f":"IF(AZ20<>0,VLOOKUP(AZ20,MMSSum!$S$8:$X$12,5,FALSE),0)","v":0},{"$f":"IF(BA20<>0,VLOOKUP(BA20,MMSSum!$S$8:$X$12,5,FALSE),0)","v":0},{"$f":"IF(BB20<>0,VLOOKUP(BB20,MMSSum!$S$8:$X$12,5,FALSE),0)","v":0},{"$f":"IF(BC20<>0,VLOOKUP(BC20,MMSSum!$S$8:$X$12,5,FALSE),0)","v":0},{"$f":"IF(BD20<>0,VLOOKUP(BD20,MMSSum!$S$8:$X$12,5,FALSE),0)","v":0},{"$f":"IF(BE20<>0,VLOOKUP(BE20,MMSSum!$S$8:$X$12,5,FALSE),0)","v":0}]
[null,null,null,null,"CO2-e From N2O Volatilisation",{"$f":"SUM(H69:BE69)","v":210157.64421684243},{"$f":"G68*G$61","v":0},1672.1906098564116,{"$f":"I68*I$61","v":1618.2791109346063},33292.378121612281,18021.013861338863,-6187.861015092225,29448.35975490855,43156.790556243919,89136.493217040043,{"$f":"P68*P$61","v":0},0,0,0,0,0,0,0,0,0,0,0,0,0,0,0,0,0,0,0,0,0,0,0,0,0,0,0,0,0,0,0,0,0,0,0,0,0,0,0,0,0]
[null,null,null,null,"N2O LRO CO2-e/kg N",null,{"$f":"IF(G20<>0,VLOOKUP(G20,MMSSum!$S$8:$X$12,6,FALSE),0)","v":0},{"$f":"IF(H20<>0,VLOOKUP(H20,MMSSum!$S$8:$X$12,6,FALSE),0)","v":0.36446064776785708},{"$f":"IF(I20<>0,VLOOKUP(I20,MMSSum!$S$8:$X$12,6,FALSE),0)","v":0.36446064776785708},{"$f":"IF(J20<>0,VLOOKUP(J20,MMSSum!$S$8:$X$12,6,FALSE),0)","v":0.36446064776785708},{"$f":"IF(K20<>0,VLOOKUP(K20,MMSSum!$S$8:$X$12,6,FALSE),0)","v":0.36446064776785708},{"$f":"IF(L20<>0,VLOOKUP(L20,MMSSum!$S$8:$X$12,6,FALSE),0)","v":0.36446064776785708},{"$f":"IF(M20<>0,VLOOKUP(M20,MMSSum!$S$8:$X$12,6,FALSE),0)","v":0.32434580357142861},{"$f":"IF(N20<>0,VLOOKUP(N20,MMSSum!$S$8:$X$12,6,FALSE),0)","v":0.36446064776785708},{"$f":"IF(O20<>0,VLOOKUP(O20,MMSSum!$S$8:$X$12,6,FALSE),0)","v":0.36446064776785708},{"$f":"IF(P20<>0,VLOOKUP(P20,MMSSum!$S$8:$X$12,6,FALSE),0)","v":0},{"$f":"IF(Q20<>0,VLOOKUP(Q20,MMSSum!$S$8:$X$12,6,FALSE),0)","v":0},{"$f":"IF(R20<>0,VLOOKUP(R20,MMSSum!$S$8:$X$12,6,FALSE),0)","v":0},{"$f":"IF(S20<>0,VLOOKUP(S20,MMSSum!$S$8:$X$12,6,FALSE),0)","v":0},{"$f":"IF(T20<>0,VLOOKUP(T20,MMSSum!$S$8:$X$12,6,FALSE),0)","v":0},{"$f":"IF(U20<>0,VLOOKUP(U20,MMSSum!$S$8:$X$12,6,FALSE),0)","v":0},{"$f":"IF(V20<>0,VLOOKUP(V20,MMSSum!$S$8:$X$12,6,FALSE),0)","v":0},{"$f":"IF(W20<>0,VLOOKUP(W20,MMSSum!$S$8:$X$12,6,FALSE),0)","v":0},{"$f":"IF(X20<>0,VLOOKUP(X20,MMSSum!$S$8:$X$12,6,FALSE),0)","v":0},{"$f":"IF(Y20<>0,VLOOKUP(Y20,MMSSum!$S$8:$X$12,6,FALSE),0)","v":0},{"$f":"IF(Z20<>0,VLOOKUP(Z20,MMSSum!$S$8:$X$12,6,FALSE),0)","v":0},{"$f":"IF(AA20<>0,VLOOKUP(AA20,MMSSum!$S$8:$X$12,6,FALSE),0)","v":0},{"$f":"IF(AB20<>0,VLOOKUP(AB20,MMSSum!$S$8:$X$12,6,FALSE),0)","v":0},{"$f":"IF(AC20<>0,VLOOKUP(AC20,MMSSum!$S$8:$X$12,6,FALSE),0)","v":0},{"$f":"IF(AD20<>0,VLOOKUP(AD20,MMSSum!$S$8:$X$12,6,FALSE),0)","v":0},{"$f":"IF(AE20<>0,VLOOKUP(AE20,MMSSum!$S$8:$X$12,6,FALSE),0)","v":0},{"$f":"IF(AF20<>0,VLOOKUP(AF20,MMSSum!$S$8:$X$12,6,FALSE),0)","v":0},{"$f":"IF(AG20<>0,VLOOKUP(AG20,MMSSum!$S$8:$X$12,6,FALSE),0)","v":0},{"$f":"IF(AH20<>0,VLOOKUP(AH20,MMSSum!$S$8:$X$12,6,FALSE),0)","v":0},{"$f":"IF(AI20<>0,VLOOKUP(AI20,MMSSum!$S$8:$X$12,6,FALSE),0)","v":0},{"$f":"IF(AJ20<>0,VLOOKUP(AJ20,MMSSum!$S$8:$X$12,6,FALSE),0)","v":0},{"$f":"IF(AK20<>0,VLOOKUP(AK20,MMSSum!$S$8:$X$12,6,FALSE),0)","v":0},{"$f":"IF(AL20<>0,VLOOKUP(AL20,MMSSum!$S$8:$X$12,6,FALSE),0)","v":0},{"$f":"IF(AM20<>0,VLOOKUP(AM20,MMSSum!$S$8:$X$12,6,FALSE),0)","v":0},{"$f":"IF(AN20<>0,VLOOKUP(AN20,MMSSum!$S$8:$X$12,6,FALSE),0)","v":0},{"$f":"IF(AO20<>0,VLOOKUP(AO20,MMSSum!$S$8:$X$12,6,FALSE),0)","v":0},{"$f":"IF(AP20<>0,VLOOKUP(AP20,MMSSum!$S$8:$X$12,6,FALSE),0)","v":0},{"$f":"IF(AQ20<>0,VLOOKUP(AQ20,MMSSum!$S$8:$X$12,6,FALSE),0)","v":0},{"$f":"IF(AR20<>0,VLOOKUP(AR20,MMSSum!$S$8:$X$12,6,FALSE),0)","v":0},{"$f":"IF(AS20<>0,VLOOKUP(AS20,MMSSum!$S$8:$X$12,6,FALSE),0)","v":0},{"$f":"IF(AT20<>0,VLOOKUP(AT20,MMSSum!$S$8:$X$12,6,FALSE),0)","v":0},{"$f":"IF(AU20<>0,VLOOKUP(AU20,MMSSum!$S$8:$X$12,6,FALSE),0)","v":0},{"$f":"IF(AV20<>0,VLOOKUP(AV20,MMSSum!$S$8:$X$12,6,FALSE),0)","v":0},{"$f":"IF(AW20<>0,VLOOKUP(AW20,MMSSum!$S$8:$X$12,6,FALSE),0)","v":0},{"$f":"IF(AX20<>0,VLOOKUP(AX20,MMSSum!$S$8:$X$12,6,FALSE),0)","v":0},{"$f":"IF(AY20<>0,VLOOKUP(AY20,MMSSum!$S$8:$X$12,6,FALSE),0)","v":0},{"$f":"IF(AZ20<>0,VLOOKUP(AZ20,MMSSum!$S$8:$X$12,6,FALSE),0)","v":0},{"$f":"IF(BA20<>0,VLOOKUP(BA20,MMSSum!$S$8:$X$12,6,FALSE),0)","v":0},{"$f":"IF(BB20<>0,VLOOKUP(BB20,MMSSum!$S$8:$X$12,6,FALSE),0)","v":0},{"$f":"IF(BC20<>0,VLOOKUP(BC20,MMSSum!$S$8:$X$12,6,FALSE),0)","v":0},{"$f":"IF(BD20<>0,VLOOKUP(BD20,MMSSum!$S$8:$X$12,6,FALSE),0)","v":0},{"$f":"IF(BE20<>0,VLOOKUP(BE20,MMSSum!$S$8:$X$12,6,FALSE),0)","v":0}]
[null,null,null,null,"CO2-e From Leach & Runoff N2O",{"$f":"SUM(H71:BE71)","v":37947.043717280547},{"$f":"G70*G$61","v":0},310.82375257406392,{"$f":"I70*I$61","v":300.8027810992827},6188.3267606452873,3349.7133165049572,-1150.1883635639333,4357.130228736678,8021.9058226241987,16568.529418660011,{"$f":"P70*P$61","v":0},0,0,0,0,0,0,0,0,0,0,0,0,0,0,0,0,0,0,0,0,0,0,0,0,0,0,0,0,0,0,0,0,0,0,0,0,0,0,0,0,0]
[null,null,null,null,"Soil - Vol N20 CO2-e/kg N",null,{"$f":"IF(G20<>0,VLOOKUP(G20,MMSSum!$S$8:$Y$12,7,FALSE),0)","v":0},{"$f":"IF(H20<>0,VLOOKUP(H20,MMSSum!$S$8:$Y$12,7,FALSE),0)","v":2.9011792857142855},{"$f":"IF(I20<>0,VLOOKUP(I20,MMSSum!$S$8:$Y$12,7,FALSE),0)","v":2.9011792857142855},{"$f":"IF(J20<>0,VLOOKUP(J20,MMSSum!$S$8:$Y$12,7,FALSE),0)","v":2.9011792857142855},{"$f":"IF(K20<>0,VLOOKUP(K20,MMSSum!$S$8:$Y$12,7,FALSE),0)","v":2.9011792857142855},{"$f":"IF(L20<>0,VLOOKUP(L20,MMSSum!$S$8:$Y$12,7,FALSE),0)","v":2.9011792857142855},{"$f":"IF(M20<>0,VLOOKUP(M20,MMSSum!$S$8:$Y$12,7,FALSE),0)","v":2.5818571428571429},{"$f":"IF(N20<>0,VLOOKUP(N20,MMSSum!$S$8:$Y$12,7,FALSE),0)","v":2.9011792857142855},{"$f":"IF(O20<>0,VLOOKUP(O20,MMSSum!$S$8:$Y$12,7,FALSE),0)","v":2.9011792857142855},{"$f":"IF(P20<>0,VLOOKUP(P20,MMSSum!$S$8:$Y$12,7,FALSE),0)","v":0},{"$f":"IF(Q20<>0,VLOOKUP(Q20,MMSSum!$S$8:$Y$12,7,FALSE),0)","v":0},{"$f":"IF(R20<>0,VLOOKUP(R20,MMSSum!$S$8:$Y$12,7,FALSE),0)","v":0},{"$f":"IF(S20<>0,VLOOKUP(S20,MMSSum!$S$8:$Y$12,7,FALSE),0)","v":0},{"$f":"IF(T20<>0,VLOOKUP(T20,MMSSum!$S$8:$Y$12,7,FALSE),0)","v":0},{"$f":"IF(U20<>0,VLOOKUP(U20,MMSSum!$S$8:$Y$12,7,FALSE),0)","v":0},{"$f":"IF(V20<>0,VLOOKUP(V20,MMSSum!$S$8:$Y$12,7,FALSE),0)","v":0},{"$f":"IF(W20<>0,VLOOKUP(W20,MMSSum!$S$8:$Y$12,7,FALSE),0)","v":0},{"$f":"IF(X20<>0,VLOOKUP(X20,MMSSum!$S$8:$Y$12,7,FALSE),0)","v":0},{"$f":"IF(Y20<>0,VLOOKUP(Y20,MMSSum!$S$8:$Y$12,7,FALSE),0)","v":0},{"$f":"IF(Z20<>0,VLOOKUP(Z20,MMSSum!$S$8:$Y$12,7,FALSE),0)","v":0},{"$f":"IF(AA20<>0,VLOOKUP(AA20,MMSSum!$S$8:$Y$12,7,FALSE),0)","v":0},{"$f":"IF(AB20<>0,VLOOKUP(AB20,MMSSum!$S$8:$Y$12,7,FALSE),0)","v":0},{"$f":"IF(AC20<>0,VLOOKUP(AC20,MMSSum!$S$8:$Y$12,7,FALSE),0)","v":0},{"$f":"IF(AD20<>0,VLOOKUP(AD20,MMSSum!$S$8:$Y$12,7,FALSE),0)","v":0},{"$f":"IF(AE20<>0,VLOOKUP(AE20,MMSSum!$S$8:$Y$12,7,FALSE),0)","v":0},{"$f":"IF(AF20<>0,VLOOKUP(AF20,MMSSum!$S$8:$Y$12,7,FALSE),0)","v":0},{"$f":"IF(AG20<>0,VLOOKUP(AG20,MMSSum!$S$8:$Y$12,7,FALSE),0)","v":0},{"$f":"IF(AH20<>0,VLOOKUP(AH20,MMSSum!$S$8:$Y$12,7,FALSE),0)","v":0},{"$f":"IF(AI20<>0,VLOOKUP(AI20,MMSSum!$S$8:$Y$12,7,FALSE),0)","v":0},{"$f":"IF(AJ20<>0,VLOOKUP(AJ20,MMSSum!$S$8:$Y$12,7,FALSE),0)","v":0},{"$f":"IF(AK20<>0,VLOOKUP(AK20,MMSSum!$S$8:$Y$12,7,FALSE),0)","v":0},{"$f":"IF(AL20<>0,VLOOKUP(AL20,MMSSum!$S$8:$Y$12,7,FALSE),0)","v":0},{"$f":"IF(AM20<>0,VLOOKUP(AM20,MMSSum!$S$8:$Y$12,7,FALSE),0)","v":0},{"$f":"IF(AN20<>0,VLOOKUP(AN20,MMSSum!$S$8:$Y$12,7,FALSE),0)","v":0},{"$f":"IF(AO20<>0,VLOOKUP(AO20,MMSSum!$S$8:$Y$12,7,FALSE),0)","v":0},{"$f":"IF(AP20<>0,VLOOKUP(AP20,MMSSum!$S$8:$Y$12,7,FALSE),0)","v":0},{"$f":"IF(AQ20<>0,VLOOKUP(AQ20,MMSSum!$S$8:$Y$12,7,FALSE),0)","v":0},{"$f":"IF(AR20<>0,VLOOKUP(AR20,MMSSum!$S$8:$Y$12,7,FALSE),0)","v":0},{"$f":"IF(AS20<>0,VLOOKUP(AS20,MMSSum!$S$8:$Y$12,7,FALSE),0)","v":0},{"$f":"IF(AT20<>0,VLOOKUP(AT20,MMSSum!$S$8:$Y$12,7,FALSE),0)","v":0},{"$f":"IF(AU20<>0,VLOOKUP(AU20,MMSSum!$S$8:$Y$12,7,FALSE),0)","v":0},{"$f":"IF(AV20<>0,VLOOKUP(AV20,MMSSum!$S$8:$Y$12,7,FALSE),0)","v":0},{"$f":"IF(AW20<>0,VLOOKUP(AW20,MMSSum!$S$8:$Y$12,7,FALSE),0)","v":0},{"$f":"IF(AX20<>0,VLOOKUP(AX20,MMSSum!$S$8:$Y$12,7,FALSE),0)","v":0},{"$f":"IF(AY20<>0,VLOOKUP(AY20,MMSSum!$S$8:$Y$12,7,FALSE),0)","v":0},{"$f":"IF(AZ20<>0,VLOOKUP(AZ20,MMSSum!$S$8:$Y$12,7,FALSE),0)","v":0},{"$f":"IF(BA20<>0,VLOOKUP(BA20,MMSSum!$S$8:$Y$12,7,FALSE),0)","v":0},{"$f":"IF(BB20<>0,VLOOKUP(BB20,MMSSum!$S$8:$Y$12,7,FALSE),0)","v":0},{"$f":"IF(BC20<>0,VLOOKUP(BC20,MMSSum!$S$8:$Y$12,7,FALSE),0)","v":0},{"$f":"IF(BD20<>0,VLOOKUP(BD20,MMSSum!$S$8:$Y$12,7,FALSE),0)","v":0},{"$f":"IF(BE20<>0,VLOOKUP(BE20,MMSSum!$S$8:$Y$12,7,FALSE),0)","v":0}]
[null,null,null,null,"CO2-e from Soil - Vol N20",null,{"$f":"G72*G$61","v":0},2474.218925962698,{"$f":"I72*I$61","v":2394.4499988002603},{"$f":"J72*J$61","v":49260.312522549561},26664.384608994686,-9155.7282671755893,34683.623711336732,63855.966747257306,131888.79139231853,0,0,0,0,0,0,0,0,0,0,0,0,0,0,0,0,0,0,0,0,0,0,0,0,0,0,0,0,0,0,0,0,0,0,0,0,0,0,0,0,0,0]
[null,null,null,null,"CO2-e/kg N",null,{"$f":"G66+G68+G70","v":0},3.2751392191964279,{"$f":"I66+I68+I70","v":3.2751392191964279},3.2751392191964279,3.2751392191964279,3.2751392191964279,12.25934580357143,3.2751392191964279,3.2751392191964279,{"$f":"P66+P68+P70","v":0},0,0,0,0,0,0,0,0,0,0,0,0,0,0,0,0,0,0,0,0,0,0,0,0,0,0,0,0,0,0,0,0,0,0,0,0,0,0,0,0,0]
[null,null,null,null,"Total CO2-e kg from N",{"$f":"SUM(H75:BE75)","v":466534.88428601297},{"$f":"G74*G61","v":0},2793.1439746590472,{"$f":"I74*I61","v":2703.0928898779839},55609.931549870969,30101.404700728486,-10335.895087831273,164687.0888943499,72086.955157669508,148889.1622066884,0,0,0,0,0,0,0,0,0,0,0,0,0,0,0,0,0,0,0,0,0,0,0,0,{"$f":"AN74*AN61","v":0},0,0,0,0,0,0,0,0,0,0,0,0,0,0,0,0,0]
[null,null,null,null,"Total CO2-e kg/year",{"$f":"SUM(H76:BE76)","v":4188891.6507885959},{"$f":"G65+G75","v":0},53198.203788853512,{"$f":"I65+I75","v":32141.138234570361},644224.02034292964,254391.35175918881,19865.048291488572,176086.19562020988,952162.96336354082,2056822.7293878142,0,0,0,0,0,0,0,0,0,0,0,0,0,0,0,0,0,0,0,0,0,0,0,0,{"$f":"AN65+AN75","v":0},0,0,0,0,0,0,0,0,0,0,0,0,0,0,0,0,0]
[]
[null,null,null,"Enteric  kg CH4/year",null,null,{"$f":"(G34*G36/100*G38*CH4GE/FFactor)*G19*365.25","v":0},81.886507338947112,{"$f":"(I34*I36/100*I38*CH4GE/FFactor)*I19*365.25","v":63.203815952310592},1268.5908773285198,599.58061910375386,16.69568749547058,1263.0079597519702,1824.6643161446134,3722.8605956811389,0,0,0,0,0,0,0,0,0,0,0,0,0,0,0,0,0,0,0,0,0,0,0,0,{"$f":"(AN34*AN36/100*AN38*CH4GE/FFactor)*AN19*365.25","v":0},0,0,0,0,0,0,0,0,0,0,0,0,0,0,0,0,0]
[null,null,null,null,"CH4 to CO2-e Conversion",null,{"$f":"IF(G78<>0,CFCH4,0)","v":0},21,{"$f":"IF(I78<>0,CFCH4,0)","v":21},21,21,21,21,21,21,0,0,0,0,0,0,0,0,0,0,0,0,0,0,0,0,0,0,0,0,0,0,0,0,{"$f":"IF(AN78<>0,CFCH4,0)","v":0},0,0,0,0,0,0,0,0,0,0,0,0,0,0,0,0,0]
[null,null,null,null,"Enteric CO2-e kg /year",{"$f":"SUM(H80:BE80)","v":185650.29795473121},{"$f":"G79*G78","v":0},1719.6166541178893,{"$f":"I79*I78","v":1327.2801349985225},{"$f":"J79*J78","v":26640.408423898916},12591.193001178832,350.60943740488216,26523.167154791376,38317.950639036884,78180.072509303922,0,0,0,0,0,0,0,0,0,0,0,0,0,0,0,0,0,0,0,0,0,0,0,0,0,0,0,0,0,0,0,0,0,0,0,0,0,0,0,0,0,0]
[]
[null,null,null,"MMS + Enteric CO2-e kg/year",null,{"$f":"SUM(H82:BE82)","v":4374541.9487433266},{"$f":"G80+G76","v":0},54917.820442971402,{"$f":"I80+I76","v":33468.418369568884},{"$f":"J80+J76","v":670864.4287668285},266982.54476036766,20215.657728893453,202609.36277500127,990480.91400257766,2135002.8018971179,0,0,0,0,0,0,0,0,0,0,0,0,0,0,0,0,0,0,0,0,0,0,0,0,0,0,0,0,0,0,0,0,0,0,0,0,0,0,0,0,0,0]
[null,null,null,null,"CO2-e t/year",{"$f":"SUM(H83:BE83)","v":4374.5419487433264},{"$f":"G82/1000","v":0},54.917820442971404,{"$f":"I82/1000","v":33.468418369568887},{"$f":"J82/1000","v":670.8644287668285},266.98254476036766,20.215657728893454,202.60936277500127,990.48091400257761,2135.0028018971179,0,0,0,0,0,0,0,0,0,0,0,0,0,0,0,0,0,0,0,0,0,0,0,0,0,0,0,0,0,0,0,0,0,0,0,0,0,0,0,0,0,0]
[]
[null,null,null,"kg CO2-e : kg Gain",null,null,{"$f":"IF(AND((G23-G22)<>0,(G25-G24)<>0),G82/(((G25-G24)/(G23-G22))*365.25*G19),0)","v":0},4.2099903419663223,{"$f":"IF(AND((I23-I22)<>0,(I25-I24)<>0),I82/(((I25-I24)/(I23-I22))*365.25*I19),0)","v":20.178599026032948},39.163893844410964,0,0.14564824751134048,0.51966690074545618,2.1527135020076771,2.6044129881529439,0,0,0,0,0,0,0,0,0,0,0,0,0,0,0,0,0,0,0,0,0,0,0,0,{"$f":"IF(AND((AN23-AN22)<>0,(AN25-AN24)<>0),AN82/(((AN25-AN24)/(AN23-AN22))*365.25*AN19),0)","v":0},0,0,0,0,0,0,0,0,0,0,0,0,0,0,0,0,0]
[]
[null,null,null,"Exported Manure kg CO2-e"]
[null,null,null,null,"CO2-e/kg N",null,{"$f":"IF(G20<>0,VLOOKUP(G20,MMSSum!$S$8:$AA$12,9,FALSE),0)","v":0},{"$f":"IF(H20<>0,VLOOKUP(H20,MMSSum!$S$8:$AA$12,9,FALSE),0)","v":0},{"$f":"IF(I20<>0,VLOOKUP(I20,MMSSum!$S$8:$AA$12,9,FALSE),0)","v":0},{"$f":"IF(J20<>0,VLOOKUP(J20,MMSSum!$S$8:$AA$12,9,FALSE),0)","v":0},{"$f":"IF(K20<>0,VLOOKUP(K20,MMSSum!$S$8:$AA$12,9,FALSE),0)","v":0},{"$f":"IF(L20<>0,VLOOKUP(L20,MMSSum!$S$8:$AA$12,9,FALSE),0)","v":0},{"$f":"IF(M20<>0,VLOOKUP(M20,MMSSum!$S$8:$AA$12,9,FALSE),0)","v":0},{"$f":"IF(N20<>0,VLOOKUP(N20,MMSSum!$S$8:$AA$12,9,FALSE),0)","v":0},{"$f":"IF(O20<>0,VLOOKUP(O20,MMSSum!$S$8:$AA$12,9,FALSE),0)","v":0},{"$f":"IF(P20<>0,VLOOKUP(P20,MMSSum!$S$8:$AA$12,9,FALSE),0)","v":0},{"$f":"IF(Q20<>0,VLOOKUP(Q20,MMSSum!$S$8:$AA$12,9,FALSE),0)","v":0},{"$f":"IF(R20<>0,VLOOKUP(R20,MMSSum!$S$8:$AA$12,9,FALSE),0)","v":0},{"$f":"IF(S20<>0,VLOOKUP(S20,MMSSum!$S$8:$AA$12,9,FALSE),0)","v":0},{"$f":"IF(T20<>0,VLOOKUP(T20,MMSSum!$S$8:$AA$12,9,FALSE),0)","v":0},{"$f":"IF(U20<>0,VLOOKUP(U20,MMSSum!$S$8:$AA$12,9,FALSE),0)","v":0},{"$f":"IF(V20<>0,VLOOKUP(V20,MMSSum!$S$8:$AA$12,9,FALSE),0)","v":0},{"$f":"IF(W20<>0,VLOOKUP(W20,MMSSum!$S$8:$AA$12,9,FALSE),0)","v":0},{"$f":"IF(X20<>0,VLOOKUP(X20,MMSSum!$S$8:$AA$12,9,FALSE),0)","v":0},{"$f":"IF(Y20<>0,VLOOKUP(Y20,MMSSum!$S$8:$AA$12,9,FALSE),0)","v":0},{"$f":"IF(Z20<>0,VLOOKUP(Z20,MMSSum!$S$8:$AA$12,9,FALSE),0)","v":0},{"$f":"IF(AA20<>0,VLOOKUP(AA20,MMSSum!$S$8:$AA$12,9,FALSE),0)","v":0},{"$f":"IF(AB20<>0,VLOOKUP(AB20,MMSSum!$S$8:$AA$12,9,FALSE),0)","v":0},{"$f":"IF(AC20<>0,VLOOKUP(AC20,MMSSum!$S$8:$AA$12,9,FALSE),0)","v":0},{"$f":"IF(AD20<>0,VLOOKUP(AD20,MMSSum!$S$8:$AA$12,9,FALSE),0)","v":0},{"$f":"IF(AE20<>0,VLOOKUP(AE20,MMSSum!$S$8:$AA$12,9,FALSE),0)","v":0},{"$f":"IF(AF20<>0,VLOOKUP(AF20,MMSSum!$S$8:$AA$12,9,FALSE),0)","v":0},{"$f":"IF(AG20<>0,VLOOKUP(AG20,MMSSum!$S$8:$AA$12,9,FALSE),0)","v":0},{"$f":"IF(AH20<>0,VLOOKUP(AH20,MMSSum!$S$8:$AA$12,9,FALSE),0)","v":0},{"$f":"IF(AI20<>0,VLOOKUP(AI20,MMSSum!$S$8:$AA$12,9,FALSE),0)","v":0},{"$f":"IF(AJ20<>0,VLOOKUP(AJ20,MMSSum!$S$8:$AA$12,9,FALSE),0)","v":0},{"$f":"IF(AK20<>0,VLOOKUP(AK20,MMSSum!$S$8:$AA$12,9,FALSE),0)","v":0},{"$f":"IF(AL20<>0,VLOOKUP(AL20,MMSSum!$S$8:$AA$12,9,FALSE),0)","v":0},{"$f":"IF(AM20<>0,VLOOKUP(AM20,MMSSum!$S$8:$AA$12,9,FALSE),0)","v":0},{"$f":"IF(AN20<>0,VLOOKUP(AN20,MMSSum!$S$8:$AA$12,9,FALSE),0)","v":0},{"$f":"IF(AO20<>0,VLOOKUP(AO20,MMSSum!$S$8:$AA$12,9,FALSE),0)","v":0},{"$f":"IF(AP20<>0,VLOOKUP(AP20,MMSSum!$S$8:$AA$12,9,FALSE),0)","v":0},{"$f":"IF(AQ20<>0,VLOOKUP(AQ20,MMSSum!$S$8:$AA$12,9,FALSE),0)","v":0},{"$f":"IF(AR20<>0,VLOOKUP(AR20,MMSSum!$S$8:$AA$12,9,FALSE),0)","v":0},{"$f":"IF(AS20<>0,VLOOKUP(AS20,MMSSum!$S$8:$AA$12,9,FALSE),0)","v":0},{"$f":"IF(AT20<>0,VLOOKUP(AT20,MMSSum!$S$8:$AA$12,9,FALSE),0)","v":0},{"$f":"IF(AU20<>0,VLOOKUP(AU20,MMSSum!$S$8:$AA$12,9,FALSE),0)","v":0},{"$f":"IF(AV20<>0,VLOOKUP(AV20,MMSSum!$S$8:$AA$12,9,FALSE),0)","v":0},{"$f":"IF(AW20<>0,VLOOKUP(AW20,MMSSum!$S$8:$AA$12,9,FALSE),0)","v":0},{"$f":"IF(AX20<>0,VLOOKUP(AX20,MMSSum!$S$8:$AA$12,9,FALSE),0)","v":0},{"$f":"IF(AY20<>0,VLOOKUP(AY20,MMSSum!$S$8:$AA$12,9,FALSE),0)","v":0},{"$f":"IF(AZ20<>0,VLOOKUP(AZ20,MMSSum!$S$8:$AA$12,9,FALSE),0)","v":0},{"$f":"IF(BA20<>0,VLOOKUP(BA20,MMSSum!$S$8:$AA$12,9,FALSE),0)","v":0},{"$f":"IF(BB20<>0,VLOOKUP(BB20,MMSSum!$S$8:$AA$12,9,FALSE),0)","v":0},{"$f":"IF(BC20<>0,VLOOKUP(BC20,MMSSum!$S$8:$AA$12,9,FALSE),0)","v":0},{"$f":"IF(BD20<>0,VLOOKUP(BD20,MMSSum!$S$8:$AA$12,9,FALSE),0)","v":0},{"$f":"IF(BE20<>0,VLOOKUP(BE20,MMSSum!$S$8:$AA$12,9,FALSE),0)","v":0}]
[null,null,null,null,"CO2-e",null,{"$f":"G88*G61","v":0},0,{"$f":"I88*I61","v":0},0,0,0,0,0,0,0,0,0,0,0,0,0,0,0,0,0,0,0,0,0,0,0,0,0,0,0,0,0,0,0,0,0,0,0,0,0,0,0,0,0,0,0,0,0,0,0,0]
[null,null,null,null,"CO2-e/kg VS",null,{"$f":"IF(G20<>0,VLOOKUP(G20,MMSSum!$S$8:$AA$12,8,FALSE),0)","v":0},{"$f":"IF(H20<>0,VLOOKUP(H20,MMSSum!$S$8:$AA$12,8,FALSE),0)","v":0},{"$f":"IF(I20<>0,VLOOKUP(I20,MMSSum!$S$8:$AA$12,8,FALSE),0)","v":0},{"$f":"IF(J20<>0,VLOOKUP(J20,MMSSum!$S$8:$AA$12,8,FALSE),0)","v":0},{"$f":"IF(K20<>0,VLOOKUP(K20,MMSSum!$S$8:$AA$12,8,FALSE),0)","v":0},{"$f":"IF(L20<>0,VLOOKUP(L20,MMSSum!$S$8:$AA$12,8,FALSE),0)","v":0},{"$f":"IF(M20<>0,VLOOKUP(M20,MMSSum!$S$8:$AA$12,8,FALSE),0)","v":0},{"$f":"IF(N20<>0,VLOOKUP(N20,MMSSum!$S$8:$AA$12,8,FALSE),0)","v":0},{"$f":"IF(O20<>0,VLOOKUP(O20,MMSSum!$S$8:$AA$12,8,FALSE),0)","v":0},{"$f":"IF(P20<>0,VLOOKUP(P20,MMSSum!$S$8:$AA$12,8,FALSE),0)","v":0},{"$f":"IF(Q20<>0,VLOOKUP(Q20,MMSSum!$S$8:$AA$12,8,FALSE),0)","v":0},{"$f":"IF(R20<>0,VLOOKUP(R20,MMSSum!$S$8:$AA$12,8,FALSE),0)","v":0},{"$f":"IF(S20<>0,VLOOKUP(S20,MMSSum!$S$8:$AA$12,8,FALSE),0)","v":0},{"$f":"IF(T20<>0,VLOOKUP(T20,MMSSum!$S$8:$AA$12,8,FALSE),0)","v":0},{"$f":"IF(U20<>0,VLOOKUP(U20,MMSSum!$S$8:$AA$12,8,FALSE),0)","v":0},{"$f":"IF(V20<>0,VLOOKUP(V20,MMSSum!$S$8:$AA$12,8,FALSE),0)","v":0},{"$f":"IF(W20<>0,VLOOKUP(W20,MMSSum!$S$8:$AA$12,8,FALSE),0)","v":0},{"$f":"IF(X20<>0,VLOOKUP(X20,MMSSum!$S$8:$AA$12,8,FALSE),0)","v":0},{"$f":"IF(Y20<>0,VLOOKUP(Y20,MMSSum!$S$8:$AA$12,8,FALSE),0)","v":0},{"$f":"IF(Z20<>0,VLOOKUP(Z20,MMSSum!$S$8:$AA$12,8,FALSE),0)","v":0},{"$f":"IF(AA20<>0,VLOOKUP(AA20,MMSSum!$S$8:$AA$12,8,FALSE),0)","v":0},{"$f":"IF(AB20<>0,VLOOKUP(AB20,MMSSum!$S$8:$AA$12,8,FALSE),0)","v":0},{"$f":"IF(AC20<>0,VLOOKUP(AC20,MMSSum!$S$8:$AA$12,8,FALSE),0)","v":0},{"$f":"IF(AD20<>0,VLOOKUP(AD20,MMSSum!$S$8:$AA$12,8,FALSE),0)","v":0},{"$f":"IF(AE20<>0,VLOOKUP(AE20,MMSSum!$S$8:$AA$12,8,FALSE),0)","v":0},{"$f":"IF(AF20<>0,VLOOKUP(AF20,MMSSum!$S$8:$AA$12,8,FALSE),0)","v":0},{"$f":"IF(AG20<>0,VLOOKUP(AG20,MMSSum!$S$8:$AA$12,8,FALSE),0)","v":0},{"$f":"IF(AH20<>0,VLOOKUP(AH20,MMSSum!$S$8:$AA$12,8,FALSE),0)","v":0},{"$f":"IF(AI20<>0,VLOOKUP(AI20,MMSSum!$S$8:$AA$12,8,FALSE),0)","v":0},{"$f":"IF(AJ20<>0,VLOOKUP(AJ20,MMSSum!$S$8:$AA$12,8,FALSE),0)","v":0},{"$f":"IF(AK20<>0,VLOOKUP(AK20,MMSSum!$S$8:$AA$12,8,FALSE),0)","v":0},{"$f":"IF(AL20<>0,VLOOKUP(AL20,MMSSum!$S$8:$AA$12,8,FALSE),0)","v":0},{"$f":"IF(AM20<>0,VLOOKUP(AM20,MMSSum!$S$8:$AA$12,8,FALSE),0)","v":0},{"$f":"IF(AN20<>0,VLOOKUP(AN20,MMSSum!$S$8:$AA$12,8,FALSE),0)","v":0},{"$f":"IF(AO20<>0,VLOOKUP(AO20,MMSSum!$S$8:$AA$12,8,FALSE),0)","v":0},{"$f":"IF(AP20<>0,VLOOKUP(AP20,MMSSum!$S$8:$AA$12,8,FALSE),0)","v":0},{"$f":"IF(AQ20<>0,VLOOKUP(AQ20,MMSSum!$S$8:$AA$12,8,FALSE),0)","v":0},{"$f":"IF(AR20<>0,VLOOKUP(AR20,MMSSum!$S$8:$AA$12,8,FALSE),0)","v":0},{"$f":"IF(AS20<>0,VLOOKUP(AS20,MMSSum!$S$8:$AA$12,8,FALSE),0)","v":0},{"$f":"IF(AT20<>0,VLOOKUP(AT20,MMSSum!$S$8:$AA$12,8,FALSE),0)","v":0},{"$f":"IF(AU20<>0,VLOOKUP(AU20,MMSSum!$S$8:$AA$12,8,FALSE),0)","v":0},{"$f":"IF(AV20<>0,VLOOKUP(AV20,MMSSum!$S$8:$AA$12,8,FALSE),0)","v":0},{"$f":"IF(AW20<>0,VLOOKUP(AW20,MMSSum!$S$8:$AA$12,8,FALSE),0)","v":0},{"$f":"IF(AX20<>0,VLOOKUP(AX20,MMSSum!$S$8:$AA$12,8,FALSE),0)","v":0},{"$f":"IF(AY20<>0,VLOOKUP(AY20,MMSSum!$S$8:$AA$12,8,FALSE),0)","v":0},{"$f":"IF(AZ20<>0,VLOOKUP(AZ20,MMSSum!$S$8:$AA$12,8,FALSE),0)","v":0},{"$f":"IF(BA20<>0,VLOOKUP(BA20,MMSSum!$S$8:$AA$12,8,FALSE),0)","v":0},{"$f":"IF(BB20<>0,VLOOKUP(BB20,MMSSum!$S$8:$AA$12,8,FALSE),0)","v":0},{"$f":"IF(BC20<>0,VLOOKUP(BC20,MMSSum!$S$8:$AA$12,8,FALSE),0)","v":0},{"$f":"IF(BD20<>0,VLOOKUP(BD20,MMSSum!$S$8:$AA$12,8,FALSE),0)","v":0},{"$f":"IF(BE20<>0,VLOOKUP(BE20,MMSSum!$S$8:$AA$12,8,FALSE),0)","v":0}]
[null,null,null,null,"CO2-e",null,{"$f":"G90*G59","v":0},0,{"$f":"I90*I59","v":0},0,0,0,0,0,0,0,0,0,0,0,0,0,0,0,0,0,0,0,0,0,0,0,0,0,0,0,0,0,0,0,0,0,0,0,0,0,0,0,0,0,0,0,0,0,0,0,0]
[null,null,null,null,"Total Export",null,{"$f":"G89+G91","v":0},0,{"$f":"I89+I91","v":0},0,0,0,0,0,0,0,0,0,0,0,0,0,0,0,0,0,0,0,0,0,0,0,0,0,0,0,0,0,0,0,0,0,0,0,0,0,0,0,0,0,0,0,0,0,0,0,0]
[]
[null,null,null,"Production Data"]
[null,null,null,null,"Feed Delived t/year",{"$f":"SUM(H95:BE95)","v":5281.3835099999997},{"$f":"(G33*G19*365.25)/1000","v":0},50.769750000000002,{"$f":"(I33*I19*365.25)/1000","v":37.124010000000006},745.13191500000005,332.59665000000001,10.935585000000001,737.65890000000002,1100.4251999999999,2266.7415000000001,0,0,0,0,0,0,0,0,0,0,0,0,0,0,0,0,0,0,0,0,0,0,0,0,{"$f":"(AN33*AN19*365.25)/1000","v":0},0,0,0,0,0,0,0,0,0,0,0,0,0,0,0,0,0]
[null,null,null,null,"Feed Ingested t/yr",{"$f":"SUM(H96:BE96)","v":4807.8942292499996},{"$f":"G34*G19*365.25/1000","v":0},45.692775000000005,{"$f":"I34*I19*365.25/1000","v":35.267809499999998},707.87531925000008,315.96681749999999,8.7484680000000008,663.89301,990.38268000000005,2040.0673499999998,0,0,0,0,0,0,0,0,0,0,0,0,0,0,0,0,0,0,0,0,0,0,0,0,{"$f":"AN34*AN19*365.25/1000","v":0},0,0,0,0,0,0,0,0,0,0,0,0,0,0,0,0,0]
[null,null,null,null,"Gain t/year",null,{"$f":"IF((G23-G22)<>0,(((G25-G24)/(G23-G22))*365.25*G19)/1000,0)","v":0},13.044642857142859,{"$f":"IF((I23-I22)<>0,(((I25-I24)/(I23-I22))*365.25*I19)/1000,0)","v":1.6586096153846155},17.129666203059806,0,138.79780961538461,389.88313953488375,460.10809756097558,819.76353658536584,0,0,0,0,0,0,0,0,0,0,0,0,0,0,0,0,0,0,0,0,0,0,0,0,{"$f":"IF((AN23-AN22)<>0,(((AN25-AN24)/(AN23-AN22))*365.25*AN19)/1000,0)","v":0},0,0,0,0,0,0,0,0,0,0,0,0,0,0,0,0,0]
[null,null,null,null,"FCR Delivered",null,{"$f":"IF(G97<>0,G95/G97,0)","v":0},3.8919999999999995,{"$f":"IF(I97<>0,I95/I97,0)","v":22.382608695652177},{"$f":"IF(J97<>0,J95/J97,0)","v":43.499500000000005},0,7.8787878787878796E-2,1.8919999999999999,2.3916666666666666,2.7651162790697676,0,0,0,0,0,0,0,0,0,0,0,0,0,0,0,0,0,0,0,0,0,0,0,0,0,0,0,0,0,0,0,0,0,0,0,0,0,0,0,0,0,0]
[null,null,null,null,"FCR Ingested",null,{"$f":"IF(G97<>0,G96/G97,0)","v":0},3.5027999999999997,{"$f":"IF(I97<>0,I96/I97,0)","v":21.263478260869562},{"$f":"IF(J97<>0,J96/J97,0)","v":41.324525000000001},0,6.3030303030303034E-2,1.7027999999999999,2.1525000000000003,2.4886046511627904,0,0,0,0,0,0,0,0,0,0,0,0,0,0,0,0,0,0,0,0,0,0,0,0,0,0,0,0,0,0,0,0,0,0,0,0,0,0,0,0,0,0]
[null,null,null,null,"days in group",null,{"$f":"G23-G22","v":0},42,{"$f":"I23-I22","v":702},719,0,26,43,41,41,0,0,0,0,0,0,0,0,0,0,0,0,0,0,0,0,0,0,0,0,0,0,0,0,{"$f":"AN23-AN22","v":0},0,0,0,0,0,0,0,0,0,0,0,0,0,0,0,0,0]
[null,null,null,null,"Wt gain in group kg/pig",null,{"$f":"IF(G17=\"Lac Sow\",0,G25-G24)","v":0},30,{"$f":"IF(I17=\"Lac Sow\",0,I25-I24)","v":75.900000000000006},40,0,6.6,20,24,43,0,0,0,0,0,0,0,0,0,0,0,0,0,0,0,0,0,0,0,0,0,0,0,0,0,0,0,0,0,0,0,0,0,0,0,0,0,0,0,0,0,0]
[null,null,null,null,"ADG g/day",null,{"$f":"IF(G100<>0,G101/G100*1000,0)","v":0},714.28571428571433,{"$f":"IF(I100<>0,I101/I100*1000,0)","v":108.11965811965813},{"$f":"IF(J100<>0,J101/J100*1000,0)","v":55.632823365785818},0,253.84615384615384,465.11627906976742,585.36585365853659,1048.780487804878,0,0,0,0,0,0,0,0,0,0,0,0,0,0,0,0,0,0,0,0,0,0,0,0,0,0,0,0,0,0,0,0,0,0,0,0,0,0,0,0,0,0]
[null,null,null,null,"SPU/pig/year",null,null,{"$f":"H46/0.09","v":3.8004940791452326},3.3154944187434201,3.2985819942116166,6.3366552338572779,9.0571343829442735E-2,0.7880425052888177,1.2871085576244299,2.9543288789478961,0,0,0,0,0,0,0,0,0,0,0,0,0,0,0,0,0,0,0,0,0,0,0,0,{"$f":"AN46/0.09","v":0},0,0,0,0,0,0,0,0,0,0,0,0,0,0,0,0,0]
[null,null,null,null,"Total SPU",null,null,{"$f":"H103*H19","v":190.02470395726164},139.25076558722364,2780.7046211203929,994.85487171559259,135.58530171267577,1808.5575496378367,2769.8576160077732,6322.2638009484972,0,0,0,0,0,0,0,0,0,0,0,0,0,0,0,0,0,0,0,0,0,0,0,0,{"$f":"AN103*AN19","v":0},0,0,0,0,0,0,0,0,0,0,0,0,0,0,0,0,0]
[]
[]
[null,null,null,null,{"$f":"SUM(H82:O82)","v":4374541.9487433266},null,null,1418326.5631285382,{"$f":"E107/H107","v":3.0842981175604454}]
[]
[]
[]
[]
[]
[null,null,null,null,null,null,null,{"$f":"H95+I95+M95","v":825.55266000000006},{"$f":"H95+I95+M95","v":825.55266000000006}]
[]
[]
[null,null,null,null,null,null,null,null,{"$f":"50*2.4*365","v":43800}]
[]
[]
[]
[null,null,null,null,null,null,null,null,{"$f":"I19*I33","v":101.64}]
[null,null,null,null,null,null,null,null,{"$f":"I120*365","v":37098.6}]

{"sheet":"MMSSum","index":15,"n_rows":69,"n_cols":27,"rows_kept":69,"cut":false,"hidden":false,"merged":[[3,5,3,12],[11,4,11,8],[13,4,13,8],[15,4,15,8],[17,3,17,4],[7,4,7,8],[9,4,9,8]]}
[]
[]
[]
[null,null,null,null,null,"Manure Management Systems"]
[]
[null,null,null,null,null,null,null,null,"CO2-e",null,"CH4",null,"N2O",null,null,null,null,null,null,null,"CH4","N2O Dir.","N2O Vol.","N2O LRO","N20Soil","Export CH4","Export N2O"]
[]
[null,null,null,null,{"$f":"'MMS1'!$I$7","v":"Ponds I"},null,null,null,null,null,{"$f":"IF(ISERROR(U8),\"…….\",U8)","v":4.7998392750000001},null,{"$f":"IF( ISERROR(SUM(V8:Y8)),\"…….\",SUM(V8:Y8))","v":6.1763185049107134},null,null,null,null,null,{"$f":"'MMS1'!$I$7","v":"Ponds I"},"MMS1",{"$f":"'MMS1'!$M$10","v":4.7998392750000001},{"$f":"'MMS1'!$M$11","v":0.94992857142857146},{"$f":"'MMS1'!$M$12","v":1.9607499999999998},{"$f":"'MMS1'!$M$13","v":0.36446064776785708},{"$f":"'MMS1'!$M$14","v":2.9011792857142855},{"$f":"'MMS1'!$M$18","v":0},{"$f":"'MMS1'!$M$16","v":0}]
[null,null,null,null,null,null,null,null,null,null,null,null,null,null,null,null,null,null,{"$f":"'MMS2'!$I$7","v":"Straw Igloo"},"MMS2",{"$f":"'MMS2'!$M$10","v":9.3838500000000005E-2},{"$f":"'MMS2'!$M$11","v":9.7428571428571438},{"$f":"'MMS2'!$M$12","v":2.1921428571428572},{"$f":"'MMS2'!$M$13","v":0.32434580357142861},{"$f":"'MMS2'!$M$14","v":2.5818571428571429},{"$f":"'MMS2'!$M$18","v":0},{"$f":"'MMS2'!$M$16","v":0}]
[null,null,null,null,{"$f":"'MMS2'!$I$7","v":"Straw Igloo"},null,null,null,null,null,{"$f":"IF(ISERROR(U9),\"…….\",U9)","v":9.3838500000000005E-2},null,{"$f":"IF(ISERROR(SUM(V9:Y9)),\"…….\",SUM(V9:Y9))","v":14.841202946428572},null,null,null,null,null,{"$f":"'MMS3'!$I$7","v":"Ponds II"},"MMS3",{"$f":"'MMS3'!$M$10","v":0.62559000000000009},{"$f":"'MMS3'!$M$11","v":0.4871428571428571},{"$f":"'MMS3'!$M$12","v":0},{"$f":"'MMS3'!$M$13","v":0.61136124107142875},{"$f":"'MMS3'!$M$14","v":4.8665571428571432},{"$f":"'MMS3'!$M$18","v":0},{"$f":"'MMS3'!$M$16","v":0}]
[null,null,null,null,null,null,null,null,null,null,null,null,null,null,null,null,null,null,{"$f":"'MMS4'!$I$7","v":"Not Used"},"MMS4",{"$f":"'MMS4'!$M$10","v":5.6303100000000006},{"$f":"'MMS4'!$M$11","v":0.4871428571428571},{"$f":"'MMS4'!$M$12","v":1.9485714285714284},{"$f":"'MMS4'!$M$13","v":0.36657195535714282},{"$f":"'MMS4'!$M$14","v":2.917985714285714},{"$f":"'MMS4'!$M$18","v":0},{"$f":"'MMS4'!$M$16","v":0}]
[null,null,null,null,{"$f":"'MMS3'!$I$7","v":"Ponds II"},null,null,null,null,null,{"$f":"IF(ISERROR(U10),\"…….\",U10)","v":0.62559000000000009},null,{"$f":"IF(ISERROR(SUM(V10:Y10)),\"…….\",SUM(V10:Y10))","v":5.965061241071429},null,null,null,null,null,{"$f":"'MMS5'!$I$7","v":"Not Used"},"MMS5",{"$f":"'MMS5'!$M$10","v":4.7970241199999997},{"$f":"'MMS5'!$M$11","v":0.85249999999999992},{"$f":"'MMS5'!$M$12","v":1.9388285714285711},{"$f":"'MMS5'!$M$13","v":0.29156851821428564},{"$f":"'MMS5'!$M$14","v":2.3209434285714283},{"$f":"'MMS5'!$M$18","v":-2.8151550000000002E-3},{"$f":"'MMS5'!$M$16","v":-0.77247798669642864}]
[]
[null,null,null,null,{"$f":"'MMS4'!$I$7","v":"Not Used"},null,null,null,null,null,{"$f":"IF(ISERROR(U11),\"…….\",U11)","v":5.6303100000000006},null,{"$f":"IF(ISERROR(SUM(V11:Y11)),\"…..\",SUM(V11:Y11))","v":5.7202719553571422}]
[]
[null,null,null,null,{"$f":"'MMS5'!$I$7","v":"Not Used"},null,null,null,null,null,{"$f":"IF(ISERROR(U12),\"…….\",U12)","v":4.7970241199999997},null,{"$f":"IF(ISERROR(SUM(V12:Y12)),\"…….\",SUM(V12:Y12))","v":5.4038405182142846}]
[]
[null,null,null,"MMS SUMMARY",null,null,"MMS1","MMS2","MMS3",null,"MMS4",null,"MMS5"]
[]
[null,null,null,null,null,"CH4/kg VS",{"$f":"'MMS1'!$M$10","v":4.7998392750000001},{"$f":"U9","v":9.3838500000000005E-2},{"$f":"U10","v":0.62559000000000009},null,{"$f":"U11","v":5.6303100000000006},null,{"$f":"U12","v":4.7970241199999997}]
[]
[null,null,null,null,null,"N2O Direct/kg N",{"$f":"V8","v":0.94992857142857146},{"$f":"V9","v":9.7428571428571438},{"$f":"V10","v":0.4871428571428571},null,{"$f":"V11","v":0.4871428571428571},null,{"$f":"V12","v":0.85249999999999992}]
[]
[null,null,null,null,null,"N2O Vol./kg N",{"$f":"W8","v":1.9607499999999998},{"$f":"W9","v":2.1921428571428572},{"$f":"W10","v":0},null,{"$f":"W11","v":1.9485714285714284},null,{"$f":"W12","v":1.9388285714285711}]
[]
[null,null,null,null,null,"N2O LRO/kg N",{"$f":"X8","v":0.36446064776785708},{"$f":"X9","v":0.32434580357142861},{"$f":"X10","v":0.61136124107142875},null,{"$f":"X11","v":0.36657195535714282},null,{"$f":"X12","v":0.29156851821428564}]
[]
[null,null,null,null,null,"N2O Soil/kg N",{"$f":"Y8","v":2.9011792857142855},{"$f":"Y9","v":2.5818571428571429},{"$f":"Y10","v":4.8665571428571432},null,{"$f":"Y11","v":2.917985714285714},null,{"$f":"Y12","v":2.3209434285714283}]
[]
[]
[null,null,null,null,null,"Export CH4/kg VS",{"$f":"'MMS1'!$U$65","v":0},{"$f":"Z9","v":0},{"$f":"Z10","v":0},null,{"$f":"Z11","v":0},null,{"$f":"Z12","v":-2.8151550000000002E-3}]
[]
[null,null,null,null,null,"Export N20/kg N",{"$f":"SUM('MMS1'!V65:$AA$65)","v":0},{"$f":"AA9","v":0},{"$f":"AA10","v":0},null,{"$f":"AA11","v":0},null,{"$f":"AA12","v":-0.77247798669642864}]
[]
[null,null,null,{"$f":"'MMS1'!F20","v":"Production Type"},null,null,{"$f":"IF('MMS1'!$A$20=\"*\",\"\",'MMS1'!$I$20)","v":"Indoor"},{"$f":"IF('MMS2'!$A$13=\"*\",\"\",'MMS2'!$I$15)","v":0},{"$f":"IF('MMS2'!$A$13=\"*\",\"\",'MMS2'!$I$15)","v":0},null,{"$f":"IF('MMS4'!$A$13=\"*\",\"\",'MMS4'!$I$15)","v":0},null,{"$f":"IF('MMS5'!$A$13=\"*\",\"\",'MMS5'!$I$15)","v":0}]
[]
[null,null,null,{"$f":"'MMS1'!F22","v":"Production System"},null,null,{"$f":"IF('MMS1'!$A$22=\"*\",\"\",'MMS1'!$I$22)","v":""},{"$f":"IF('MMS2'!$A$15=\"*\",\"\",'MMS2'!$I$15)","v":0},{"$f":"IF('MMS2'!$A$15=\"*\",\"\",'MMS2'!$I$15)","v":0},null,{"$f":"IF('MMS4'!$A$15=\"*\",\"\",'MMS4'!$I$15)","v":0},null,{"$f":"IF('MMS5'!$A$15=\"*\",\"\",'MMS5'!$I$15)","v":0}]
[]
[null,null,null,null,{"$f":"'MMS1'!G30","v":"Manure Collected"},null,{"$f":"IF('MMS1'!$A$30=\"*\",\"\",'MMS1'!$M$30)","v":""},{"$f":"IF('MMS2'!$A$23=\"*\",\"\",'MMS2'!$M$23)","v":""},{"$f":"IF('MMS2'!$A$23=\"*\",\"\",'MMS2'!$M$23)","v":""},null,{"$f":"IF('MMS4'!$A$23=\"*\",\"\",'MMS4'!$M$23)","v":""},null,{"$f":"IF('MMS5'!$A$23=\"*\",\"\",'MMS5'!$M$23)","v":""}]
[]
[null,null,null,{"$f":"'MMS1'!F32","v":"Solids Usage"},null,null,{"$f":"IF('MMS1'!$A$32=\"*\",\"\",'MMS1'!$I$32)","v":""},{"$f":"IF('MMS2'!$A$25=\"*\",\"\",'MMS2'!$I$25)","v":""},{"$f":"IF('MMS2'!$A$25=\"*\",\"\",'MMS2'!$I$25)","v":""},null,{"$f":"IF('MMS4'!$A$25=\"*\",\"\",'MMS4'!$I$25)","v":""},null,{"$f":"IF('MMS5'!$A$25=\"*\",\"\",'MMS5'!$I$25)","v":""}]
[]
[null,null,null,null,{"$f":"'MMS1'!I34","v":"% Exported Off Site"},null,{"$f":"IF('MMS1'!$A$32=\"*\",\"\",'MMS1'!$M$34)","v":""},{"$f":"IF('MMS2'!$A$25=\"*\",\"\",'MMS2'!$M$27)","v":""},{"$f":"IF('MMS2'!$A$25=\"*\",\"\",'MMS2'!$M$27)","v":""},null,{"$f":"IF('MMS4'!$A$25=\"*\",\"\",'MMS4'!$M$27)","v":""},null,{"$f":"IF('MMS5'!$A$25=\"*\",\"\",'MMS5'!$M$27)","v":""}]
[]
[null,null,null,{"$f":"'MMS1'!F36","v":"Collection System"},null,null,{"$f":"IF('MMS1'!$A$36=\"*\",\"\",'MMS1'!$I$36)","v":"Liquid"},{"$f":"IF('MMS2'!$A$29=\"*\",\"\",'MMS2'!$I$29)","v":""},{"$f":"IF('MMS2'!$A$29=\"*\",\"\",'MMS2'!$I$29)","v":""},null,{"$f":"IF('MMS4'!$A$29=\"*\",\"\",'MMS4'!$I$29)","v":""},null,{"$f":"IF('MMS5'!$A$29=\"*\",\"\",'MMS5'!$I$29)","v":""}]
[]
[null,null,null,{"$f":"'MMS1'!F38","v":"Solids Usage"},null,null,{"$f":"IF('MMS1'!$A$38=\"*\",\"\",'MMS1'!$I$38)","v":""},{"$f":"IF('MMS2'!$A$31=\"*\",\"\",'MMS2'!$I$31)","v":""},{"$f":"IF('MMS2'!$A$31=\"*\",\"\",'MMS2'!$I$31)","v":""},null,{"$f":"IF('MMS4'!$A$31=\"*\",\"\",'MMS4'!$I$31)","v":""},null,{"$f":"IF('MMS5'!$A$31=\"*\",\"\",'MMS5'!$I$31)","v":""}]
[]
[null,null,null,null,{"$f":"'MMS1'!I40","v":"% Exported Off Site"},null,{"$f":"IF('MMS1'!$A$38=\"*\",\"\",'MMS1'!$M$40)","v":""},{"$f":"IF('MMS2'!$A$31=\"*\",\"\",'MMS2'!$M$33)","v":""},{"$f":"IF('MMS2'!$A$31=\"*\",\"\",'MMS2'!$M$33)","v":""},null,{"$f":"IF('MMS4'!$A$31=\"*\",\"\",'MMS4'!$M$33)","v":""},null,{"$f":"IF('MMS5'!$A$31=\"*\",\"\",'MMS5'!$M$33)","v":""}]
[]
[null,null,null,{"$f":"'MMS1'!F42","v":"Solid Extraction"},null,null,{"$f":"IF(G53<>0,'MMS1'!$I$42,\"\")","v":"Run Down Screen"},{"$f":"IF(H53<>0,'MMS2'!$I$35,\"\")","v":""},{"$f":"IF(I53<>0,'MMS3'!$I$35,\"\")","v":""},null,{"$f":"IF(K53<>0,'MMS4'!$I$35,\"\")","v":""},null,{"$f":"IF(M53<>0,'MMS5'!$I$35,\"\")","v":""}]
[]
[null,null,null,null,{"$f":"'MMS1'!I44","v":"Extracted"},{"$f":"'MMS1'!K44","v":"VS"},{"$f":"'MMS1'!$K$45","v":0.15},{"$f":"'MMS2'!$K$38","v":0},{"$f":"'MMS2'!$K$38","v":0},null,{"$f":"'MMS4'!$K$38","v":0},null,{"$f":"'MMS5'!$K$38","v":0}]
[]
[null,null,null,null,null,{"$f":"'MMS1'!M44","v":"N"},{"$f":"'MMS1'!$M$45","v":0.05},{"$f":"'MMS2'!$M$38","v":0},{"$f":"'MMS2'!$M$38","v":0},null,{"$f":"'MMS4'!$M$38","v":0},null,{"$f":"'MMS5'!$M$38","v":0}]
[]
[null,null,null,{"$f":"'MMS1'!F47","v":"Solids Usage"},null,null,{"$f":"IF('MMS1'!$A$47=\"*\",\"\",'MMS1'!$I$47)","v":"Soil Application"},{"$f":"IF('MMS2'!$A$40=\"*\",\"\",'MMS2'!$I$40)","v":""},{"$f":"IF('MMS2'!$A$40=\"*\",\"\",'MMS2'!$I$40)","v":""},null,{"$f":"IF('MMS4'!$A$40=\"*\",\"\",'MMS4'!$I$40)","v":""},null,{"$f":"IF('MMS5'!$A$40=\"*\",\"\",'MMS5'!$I$40)","v":""}]
[]
[null,null,null,null,{"$f":"'MMS1'!I49","v":"% Exported Off Site"},null,{"$f":"IF('MMS1'!$A$47=\"*\",\"\",'MMS1'!$M$49)","v":0.2},{"$f":"IF('MMS2'!$A$40=\"*\",\"\",'MMS2'!$M$42)","v":""},{"$f":"IF('MMS2'!$A$40=\"*\",\"\",'MMS2'!$M$42)","v":""},null,{"$f":"IF('MMS4'!$A$40=\"*\",\"\",'MMS4'!$M$42)","v":""},null,{"$f":"IF('MMS5'!$A$40=\"*\",\"\",'MMS5'!$M$42)","v":""}]
[]
[null,null,null,{"$f":"'MMS1'!F51","v":"Liquid Treatment"},null,null,{"$f":"IF('MMS1'!$A$51=\"*\",\"\",'MMS1'!$I$51)","v":"Anaerobic Lagoon"},{"$f":"IF('MMS2'!$A$44=\"*\",\"\",'MMS2'!$I$44)","v":""},{"$f":"IF('MMS2'!$A$44=\"*\",\"\",'MMS2'!$I$44)","v":""},null,{"$f":"IF('MMS4'!$A$44=\"*\",\"\",'MMS4'!$I$44)","v":""},null,{"$f":"IF('MMS5'!$A$44=\"*\",\"\",'MMS5'!$I$44)","v":"Extracted"}]
[]
[null,null,null,null,{"$f":"'MMS1'!I53","v":"Balance"},{"$f":"'MMS1'!K53","v":"VS"},{"$f":"'MMS1'!$K$54","v":0.85},{"$f":"'MMS2'!$K$47","v":0},{"$f":"'MMS2'!$K$47","v":0},null,{"$f":"'MMS4'!$K$47","v":0},null,{"$f":"'MMS5'!$K$47","v":0}]
[]
[null,null,null,null,null,{"$f":"'MMS1'!M53","v":"N"},{"$f":"'MMS1'!$M$54","v":0.95},{"$f":"'MMS2'!$M$47","v":0},{"$f":"'MMS2'!$M$47","v":0},null,{"$f":"'MMS4'!$M$47","v":0},null,{"$f":"'MMS5'!$M$47","v":0}]
[]
[null,null,null,{"$f":"'MMS1'!F56","v":"Treated Effluent Use"},null,null,{"$f":"IF('MMS1'!$A$56=\"*\",\"\",'MMS1'!$I$56)","v":"Soil Application"},{"$f":"IF('MMS2'!$A$49=\"*\",\"\",'MMS2'!$I$49)","v":""},{"$f":"IF('MMS2'!$A$49=\"*\",\"\",'MMS2'!$I$49)","v":""},null,{"$f":"IF('MMS4'!$A$49=\"*\",\"\",'MMS4'!$I$49)","v":""},null,{"$f":"IF('MMS5'!$A$49=\"*\",\"\",'MMS5'!$I$49)","v":"% Exported Off Site"}]
[]
[null,null,null,null,{"$f":"'MMS1'!I58","v":"% Exported Off Site"},null,{"$f":"IF('MMS1'!$A$56=\"*\",\"\",'MMS1'!$M$58)","v":0.2},{"$f":"IF('MMS2'!$A$49=\"*\",\"\",'MMS2'!$M$51)","v":""},{"$f":"IF('MMS2'!$A$49=\"*\",\"\",'MMS2'!$M$51)","v":""},{"$f":"IF('MMS1'!$A$56=\"*\",\"\",'MMS1'!$M$58)","v":0.2},{"$f":"IF('MMS4'!$A$49=\"*\",\"\",'MMS4'!$M$51)","v":""},null,{"$f":"IF('MMS5'!$A$49=\"*\",\"\",'MMS5'!$M$51)","v":0}]

{"sheet":"MMS1","index":16,"n_rows":65,"n_cols":27,"rows_kept":65,"cut":false,"hidden":false,"merged":[[15,8,17,9],[3,5,4,12],[6,8,6,12],[43,8,44,8],[52,8,53,8],[6,5,6,6],[19,5,19,6],[21,5,21,6],[31,5,31,6],[35,5,35,6],[37,5,37,6],[41,5,41,6],[46,5,46,6],[50,5,50,6],[19,8,19,10],[21,8,21,12],[31,8,31,12],[26,8,27,12],[29,6,29,10],[33,8,33,10],[23,8,24,12],[57,8,57,10],[35,8,35,12],[41,8,41,12],[37,8,37,12],[39,8,39,10],[55,5,55,6],[46,8,46,12],[50,8,50,12],[55,8,55,12],[48,8,48,10]]}
["Hide"]
[null,null,null,null,null,null,null,null,null,null,null,null,null,null,null,null,null,null,null,null,"4B.8_1","4B.8_4","4B.1.a_10c",null,"4D3_6","4D3_6"]
[null,null,null,null,null,null,null,null,null,null,null,null,null,null,null,null,null,null,null,null,null,null,"4D3_4",null,null,"4D3_7"]
[null,null,null,null,null,"Manure Management System 1",null,null,null,null,null,null,null,null,null,null,null,null,null,null,"MMS-VS","MMS Direct","MMS -N Vol","Residual","LRO ","LRO","SOIL N20"]
[null,null,null,null,null,null,null,null,null,null,null,null,null,null,null,null,null,null,"MMS","MCF","CH4","N2O","N2O","N","N","N2O","N2O"]
[]
[null,null,null,null,null,"MMS1 Name",null,null,"Ponds I"]
[]
[null,null,null,null,null,null,null,null,"Total",null,"x Factor",null,"CO2e"]
[null,null,null,null,null,null,"CH4",null,{"$f":"SUM(U22:U58)","v":0.228563775},null,{"$f":"CFCH4","v":21},null,{"$f":"K10*I10","v":4.7998392750000001}]
[null,null,null,null,null,null,"N2O Dir.",null,{"$f":"SUM(V22:V58)","v":3.0642857142857143E-3},null,{"$f":"CFN2O","v":310},null,{"$f":"K11*I11","v":0.94992857142857146}]
[null,null,null,null,null,null,"N2O Vol.",null,{"$f":"SUM(W22:W58)","v":6.324999999999999E-3},null,{"$f":"CFN2O","v":310},null,{"$f":"K12*I12","v":1.9607499999999998}]
[null,null,null,null,null,null,"N2O LRO",null,{"$f":"SUM(Z22:Z58)","v":1.1756795089285712E-3},null,{"$f":"CFN2O","v":310},null,{"$f":"K13*I13","v":0.36446064776785708}]
[null,null,null,null,null,null,"N20 Soil",null,{"$f":"SUM(AA22:AA58)","v":9.358642857142857E-3},null,{"$f":"CFN2O","v":310},null,{"$f":"K14*I14","v":2.9011792857142855}]
[]
[null,null,null,null,null,null,null,null,"Exported Manure",null,"N2O",null,{"$f":"SUM(V65:AA65)","v":0}]
[]
[null,null,null,null,null,null,null,null,null,null,"CH4",null,{"$f":"U65","v":0}]
[]
[null,null,null,null,null,"Production Type",null,null,"Indoor"]
[]
[{"$f":"IF(I20=\"Outdoor\",\"\",\"*\")","v":"*"},{"$f":"IF(A22=\"*\",0,1)","v":0},null,null,null,"Production System",null,null,"Free Range",null,null,null,null,null,null,null,{"$f":"INDEX(Assumption!$C$75:$G$75,S22)","v":"Daily Spread\n(%)"},{"$f":"IF($I$22=\"Free Range\",1,1-M30)","v":1},4,{"$f":"INDEX(TableG4MCF,MATCH(HomeState,States),'MMS1'!S22)*B22/100","v":0},{"$f":"EmmPot*'MMS1'!T22*DensCH4*R22","v":0},{"$f":"INDEX(Tale10,'MMS1'!S22)*44/28*B22*R22","v":0},{"$f":"INDEX(TableJ_1,S22)*AtmosDep*44/28*R22*B22","v":0},{"$f":"(1-INDEX(Tale10,'MMS1'!S22)-INDEX(TableJ_1,S22))*B22*R22","v":0},{"$f":"X22*VLOOKUP(HomeState,TableM2,3,FALSE)*FracLEACH","v":0},{"$f":"X22*VLOOKUP(HomeState,TableM2,3,FALSE)*FracLEACH*EFLRO*44/28","v":0},{"$f":"X22*0.01*44/28","v":0}]
[{"$f":"A22","v":"*"},{"$f":"B22","v":0},null,null,null,null,null,null,null,null,null,null,null,null,null,null,{"$f":"INDEX(Assumption!$C$75:$G$75,S23)","v":"Drylot\n(%)"},{"$f":"IF($I$22=\"Free Range\",0,M30)","v":0},3,{"$f":"INDEX(TableG4MCF,MATCH(HomeState,States),'MMS1'!S23)*B23/100","v":0},{"$f":"EmmPot*'MMS1'!T23*DensCH4*R23","v":0},{"$f":"INDEX(Tale10,'MMS1'!S23)*44/28*B23*R23","v":0},{"$f":"INDEX(TableJ_1,S23)*AtmosDep*44/28*R23*B23","v":0},{"$f":"(1-INDEX(Tale10,'MMS1'!S23)-INDEX(TableJ_1,S23))*B23*R23","v":0},{"$f":"X23*VLOOKUP(HomeState,TableM2,3,FALSE)*FracLEACH","v":0},{"$f":"X23*VLOOKUP(HomeState,TableM2,3,FALSE)*FracLEACH*EFLRO*44/28","v":0},{"$f":"X23*0.01*44/28","v":0}]
[{"$f":"A22","v":"*"},null,null,null,null,null,"Dry Lot",null,"Pigs in deep litter sheds which have access to outdoor runs"]
[{"$f":"A24","v":"*"}]
[{"$f":"A25","v":"*"}]
[{"$f":"A24","v":"*"},null,null,null,null,null,"Free Range",null,"Pigs which do not have deep litter sheds"]
[{"$f":"A27","v":"*"}]
[{"$f":"A28","v":"*"}]
[{"$f":"A32","v":"*"},null,null,null,null,null,"Manure Collected",null,null,null,null,null,0.4]
[{"$f":"A30","v":"*"}]
[{"$f":"IF(AND(I20=\"Outdoor\",I22=\"Dry Lot\"),\"\",\"*\")","v":"*"},null,null,null,null,"Solids Usage",null,null,"Export Off-Site",null,null,null,null,null,null,null,null,"Adjustment",null,null,null,null,null,{"$f":"IF($I$32=\"Export Off-Site\",X23*-1,0)*$M$34","v":0},{"$f":"IF($I$32=\"Export Off-Site\",Y23*-1,0)*$M$34","v":0},{"$f":"IF($I$32=\"Export Off-Site\",Z23*-1,0)*$M$34","v":0},{"$f":"IF($I$32=\"Export Off-Site\",AA23*-1,0)*$M$34","v":0}]
[{"$f":"A32","v":"*"}]
[{"$f":"IF(AND(I20=\"Outdoor\",I22=\"Dry Lot\",I32=\"Export Off-Site\"),\"\",\"*\")","v":"*"},{"$f":"IF(I32<>\"Export Off-Site\",\"*\",\"\")","v":""},null,null,null,null,null,null,"% Exported Off Site",null,null,null,0.8]
[{"$f":"A34","v":"*"}]
[{"$f":"IF(I20=\"Indoor\",\"\",\"*\")","v":""},{"$f":"IF(AND(I20=\"Indoor\",I36=\"Solid\"),1,0)","v":0},null,null,null,"Collection System",null,null,"Liquid",null,null,null,null,null,null,null,null,1,3,{"$f":"INDEX(TableG4MCF,MATCH(HomeState,States),'MMS1'!S36)*B36/100","v":0},{"$f":"EmmPot*'MMS1'!T36*DensCH4*R36","v":0},{"$f":"INDEX(Tale10,'MMS1'!S36)*44/28*B36*R36","v":0},{"$f":"INDEX(TableJ_1,S36)*AtmosDep*44/28*R36*B36","v":0},{"$f":"(1-INDEX(Tale10,'MMS1'!S36)-INDEX(TableJ_1,S36))*B36*R36","v":0},{"$f":"X36*VLOOKUP(HomeState,TableM2,3,FALSE)*FracLEACH","v":0},{"$f":"X36*VLOOKUP(HomeState,TableM2,3,FALSE)*FracLEACH*EFLRO*44/28","v":0},{"$f":"X36*0.01*44/28","v":0}]
[{"$f":"A36","v":""}]
[{"$f":"IF(AND(I20=\"Indoor\",I36=\"Solid\"),\"\",\"*\")","v":"*"},null,null,null,null,"Solids Usage",null,null,"Soil Application",null,null,null,null,null,null,null,null,{"$f":"R32","v":"Adjustment"},null,null,null,null,null,{"$f":"IF($I$38=\"Export Off-Site\",X36*-1,0)*$M$40","v":0},{"$f":"IF($I$38=\"Export Off-Site\",Y36*-1,0)*$M$40","v":0},{"$f":"IF($I$38=\"Export Off-Site\",Z36*-1,0)*$M$40","v":0},{"$f":"IF($I$38=\"Export Off-Site\",AA36*-1,0)*$M$40","v":0}]
[{"$f":"A38","v":"*"}]
[{"$f":"IF(AND(I36=\"Solid\",I38=\"Export Off-Site\"),\"\",\"*\")","v":"*"},null,null,null,null,null,null,null,"% Exported Off Site",null,null,null,0.5]
[{"$f":"A40","v":"*"}]
[{"$f":"IF(AND(I20=\"Indoor\",I36=\"Liquid\"),\"\",\"*\")","v":""},null,null,null,null,"Solid Extraction",null,null,"Run Down Screen"]
[{"$f":"A42","v":""}]
[{"$f":"A45","v":""},null,null,null,null,null,null,null,"Extracted",null,"VS",null,"N"]
[{"$f":"A46","v":""},{"$f":"IF(AND(I20=\"Indoor\",K45+M45<>0),1,0)","v":1},null,null,null,null,null,null,null,null,{"$f":"IF(I36=\"Liquid\",IF(ISERROR(VLOOKUP('MMS1'!$I$42,SolidExtVS_N,3,FALSE)),0,VLOOKUP('MMS1'!$I$42,SolidExtVS_N,3,FALSE)),0)","v":0.15},null,{"$f":"IF(I36=\"Liquid\",IF(ISERROR(VLOOKUP('MMS1'!$I$42,SolidExtVS_N,5,FALSE)),0,VLOOKUP('MMS1'!$I$42,SolidExtVS_N,5,FALSE)),0)","v":0.05},null,null,null,null,null,{"$f":"IF(I42=\"Effluent Daily Spread\",4,3)","v":3},{"$f":"INDEX(TableG4MCF,MATCH(HomeState,States),'MMS1'!S45)*B45/100","v":1.4999999999999999E-2},{"$f":"EmmPot*'MMS1'!T45*DensCH4*K45","v":6.7027500000000002E-4},{"$f":"INDEX(Tale10,'MMS1'!S45)*44/28*B45*M45","v":1.5714285714285717E-3},{"$f":"INDEX(TableJ_1,S45)*AtmosDep*44/28*M45*B45","v":3.5357142857142857E-4},{"$f":"(1-INDEX(Tale10,'MMS1'!S45)-INDEX(TableJ_1,S45))*B45*M45","v":2.6500000000000003E-2},{"$f":"X45*VLOOKUP(HomeState,TableM2,3,FALSE)*FracLEACH","v":2.6632500000000003E-3},{"$f":"X45*VLOOKUP(HomeState,TableM2,3,FALSE)*FracLEACH*EFLRO*44/28","v":5.231383928571429E-5},{"$f":"X45*0.01*44/28","v":4.164285714285715E-4}]
[{"$f":"A47","v":""}]
[{"$f":"IF(AND(I20=\"Indoor\",K45+M45<>0),\"\",\"*\")","v":""},null,null,null,null,"Solids Usage",null,null,"Soil Application",null,null,null,null,null,null,null,null,{"$f":"R38","v":"Adjustment"},null,null,{"$f":"IF($I$47=\"Export Off-Site\",U45*-1,0)*$M$49","v":0},0,{"$f":"IF($I$47=\"Export Off-Site\",W45*-1,0)*$M$49","v":0},{"$f":"IF(I47=\"Export Off-Site\",X45*-1,0)*M49","v":0},{"$f":"IF($I$47=\"Export Off-Site\",Y45*-1,0)*$M$49","v":0},{"$f":"IF($I$47=\"Export Off-Site\",Z45*-1,0)*$M$49","v":0},{"$f":"IF($I$47=\"Export Off-Site\",AA45*-1,0)*$M$49","v":0}]
[{"$f":"A47","v":""}]
[{"$f":"IF(AND(I20=\"Indoor\",K45+M45<>0,I47=\"Export Off-Site\"),\"\",\"*\")","v":"*"},null,null,null,null,null,null,null,"% Exported Off Site",null,null,null,0.2]
[{"$f":"A49","v":"*"}]
[{"$f":"IF(AND(I20=\"Indoor\",I36=\"Liquid\"),\"\",\"*\")","v":""},null,null,null,null,"Liquid Treatment",null,null,"Anaerobic Lagoon"]
[{"$f":"A51","v":""}]
[{"$f":"A52","v":""},null,null,null,null,null,null,null,"Balance",null,"VS",null,"N"]
[{"$f":"A53","v":""},{"$f":"IF(AND(I36=\"Liquid\",I20=\"Indoor\",K54+M54<>0),1,0)","v":1},null,null,null,null,null,null,"Balance",null,{"$f":"1-K45","v":0.85},null,{"$f":"1-M45","v":0.95},null,null,null,null,null,{"$f":"MATCH(I51,EffTreatment,0)","v":1},{"$f":"INDEX(TableG4MCF,MATCH(HomeState,States),'MMS1'!S54)*B54/100","v":0.9},{"$f":"EmmPot*'MMS1'!T54*DensCH4*K54","v":0.2278935},{"$f":"INDEX(Tale10,'MMS1'!S54)*44/28*B54*M54","v":1.4928571428571426E-3},{"$f":"INDEX(TableJ_1,S54)*AtmosDep*44/28*M54*B54","v":5.9714285714285702E-3},{"$f":"(1-INDEX(Tale10,'MMS1'!S54)-INDEX(TableJ_1,S54))*B54*M54","v":0.56904999999999994},{"$f":"X54*VLOOKUP(HomeState,TableM2,3,FALSE)*FracLEACH","v":5.7189524999999991E-2},{"$f":"X54*VLOOKUP(HomeState,TableM2,3,FALSE)*FracLEACH*EFLRO*44/28","v":1.1233656696428569E-3},{"$f":"X54*0.01*44/28","v":8.942214285714286E-3}]
[{"$f":"A54","v":""}]
[{"$f":"A55","v":""},null,null,null,null,"Treated Effluent Use",null,null,"Soil Application",null,null,null,null,null,null,null,null,{"$f":"R47","v":"Adjustment"},null,null,null,null,null,{"$f":"IF(I56=\"Export Off-Site\",X54*-1,0)*M58","v":0},{"$f":"IF(I56=\"Export Off-Site\",Y54*-1,0)*M58","v":0},{"$f":"IF($I$56=\"Export Off-Site\",Z54*-1,0)*$M$58","v":0},{"$f":"IF($I$56=\"Export Off-Site\",AA54*-1,0)*$M$58","v":0}]
[{"$f":"A58","v":"*"}]
[{"$f":"IF(AND(I56=\"Export Off-Site\",I20=\"Indoor\",I36=\"Liquid\"),\"\",\"*\")","v":"*"},null,null,null,null,null,null,null,"% Exported Off Site",null,null,null,0.2]
[]
[]
[]
[]
[null,null,null,null,null,null,null,null,null,null,null,null,null,null,null,null,null,"Export",null,null,{"$f":"SUMIF(U6:U61,\"<0\",U6:U61)","v":0},{"$f":"SUMIF(V6:V61,\"<0\",V6:V61)","v":0},{"$f":"SUMIF(W6:W61,\"<0\",W6:W61)","v":0},null,null,{"$f":"SUMIF(Z6:Z61,\"<0\",Z6:Z61)","v":0},{"$f":"SUMIF(AA6:AA61,\"<0\",AA6:AA61)","v":0}]
[null,null,null,null,null,null,null,null,null,null,null,null,null,null,null,null,null,null,null,null,{"$f":"K10","v":21},{"$f":"K11","v":310},{"$f":"K12","v":310},null,null,{"$f":"K13","v":310},{"$f":"K14","v":310}]
[null,null,null,null,null,null,null,null,null,null,null,null,null,null,null,null,null,"Export C02-e",null,null,{"$f":"U64*U63","v":0},{"$f":"V64*V63","v":0},0,null,null,0,0]

{"sheet":"MMS2","index":17,"n_rows":65,"n_cols":27,"rows_kept":65,"cut":false,"hidden":false,"merged":[[57,8,57,10],[46,5,46,6],[46,8,46,12],[48,8,48,10],[52,8,53,8],[55,5,55,6],[55,8,55,12],[50,5,50,6],[50,8,50,12],[35,8,35,12],[37,5,37,6],[37,8,37,12],[39,8,39,10],[43,8,44,8],[41,5,41,6],[41,8,41,12],[35,5,35,6],[26,8,27,12],[29,6,29,10],[31,5,31,6],[31,8,31,12],[33,8,33,10],[21,5,21,6],[21,8,21,12],[23,8,24,12],[3,5,4,12],[6,5,6,6],[6,8,6,12],[15,8,17,9],[19,5,19,6],[19,8,19,10]]}
["Hide"]
[null,null,null,null,null,null,null,null,null,null,null,null,null,null,null,null,null,null,null,null,"4B.8_1","4B.8_4","4B.1.a_10c",null,"4D3_6","4D3_6"]
[null,null,null,null,null,null,null,null,null,null,null,null,null,null,null,null,null,null,null,null,null,null,"4D3_4",null,null,"4D3_7"]
[null,null,null,null,null,"Manure Management System 1",null,null,null,null,null,null,null,null,null,null,null,null,null,null,"MMS-VS","MMS Direct","MMS -N Vol","Residual","LRO ","LRO","SOIL N20"]
[null,null,null,null,null,null,null,null,null,null,null,null,null,null,null,null,null,null,"MMS","MCF","CH4","N2O","N2O","N","N","N2O","N2O"]
[]
[null,null,null,null,null,"MMS2 Name",null,null,"Straw Igloo"]
[]
[null,null,null,null,null,null,null,null,"Total",null,"x Factor",null,"CO2e"]
[null,null,null,null,null,null,"CH4",null,{"$f":"SUM(U22:U58)","v":4.4685000000000002E-3},null,{"$f":"CFCH4","v":21},null,{"$f":"K10*I10","v":9.3838500000000005E-2}]
[null,null,null,null,null,null,"N2O Dir.",null,{"$f":"SUM(V22:V58)","v":3.1428571428571431E-2},null,{"$f":"CFN2O","v":310},null,{"$f":"K11*I11","v":9.7428571428571438}]
[null,null,null,null,null,null,"N2O Vol.",null,{"$f":"SUM(W22:W58)","v":7.0714285714285714E-3},null,{"$f":"CFN2O","v":310},null,{"$f":"K12*I12","v":2.1921428571428572}]
[null,null,null,null,null,null,"N2O LRO",null,{"$f":"SUM(Z22:Z58)","v":1.0462767857142858E-3},null,{"$f":"CFN2O","v":310},null,{"$f":"K13*I13","v":0.32434580357142861}]
[null,null,null,null,null,null,"N20 Soil",null,{"$f":"SUM(AA22:AA58)","v":8.3285714285714282E-3},null,{"$f":"CFN2O","v":310},null,{"$f":"K14*I14","v":2.5818571428571429}]
[]
[null,null,null,null,null,null,null,null,"Exported Manure",null,"N2O",null,{"$f":"SUM(V65:AA65)","v":0}]
[]
[null,null,null,null,null,null,null,null,null,null,"CH4",null,{"$f":"U65","v":0}]
[]
[null,null,null,null,null,"Production Type",null,null,"Indoor"]
[]
[{"$f":"IF(I20=\"Outdoor\",\"\",\"*\")","v":"*"},{"$f":"IF(A22=\"*\",0,1)","v":0},null,null,null,"Production System",null,null,"Free Range",null,null,null,null,null,null,null,{"$f":"INDEX(Assumption!$C$75:$G$75,S22)","v":"Daily Spread\n(%)"},{"$f":"IF($I$22=\"Free Range\",1,1-M30)","v":1},4,{"$f":"INDEX(TableG4MCF,MATCH(HomeState,States),'MMS2'!S22)*B22/100","v":0},{"$f":"EmmPot*'MMS2'!T22*DensCH4*R22","v":0},{"$f":"INDEX(Tale10,'MMS2'!S22)*44/28*B22*R22","v":0},{"$f":"INDEX(TableJ_1,S22)*AtmosDep*44/28*R22*B22","v":0},{"$f":"(1-INDEX(Tale10,'MMS2'!S22)-INDEX(TableJ_1,S22))*B22*R22","v":0},{"$f":"X22*VLOOKUP(HomeState,TableM2,3,FALSE)*FracLEACH","v":0},{"$f":"X22*VLOOKUP(HomeState,TableM2,3,FALSE)*FracLEACH*EFLRO*44/28","v":0},{"$f":"X22*0.01*44/28","v":0}]
[{"$f":"A22","v":"*"},{"$f":"B22","v":0},null,null,null,null,null,null,null,null,null,null,null,null,null,null,{"$f":"INDEX(Assumption!$C$75:$G$75,S23)","v":"Drylot\n(%)"},{"$f":"IF($I$22=\"Free Range\",0,M30)","v":0},3,{"$f":"INDEX(TableG4MCF,MATCH(HomeState,States),'MMS2'!S23)*B23/100","v":0},{"$f":"EmmPot*'MMS2'!T23*DensCH4*R23","v":0},{"$f":"INDEX(Tale10,'MMS2'!S23)*44/28*B23*R23","v":0},{"$f":"INDEX(TableJ_1,S23)*AtmosDep*44/28*R23*B23","v":0},{"$f":"(1-INDEX(Tale10,'MMS2'!S23)-INDEX(TableJ_1,S23))*B23*R23","v":0},{"$f":"X23*VLOOKUP(HomeState,TableM2,3,FALSE)*FracLEACH","v":0},{"$f":"X23*VLOOKUP(HomeState,TableM2,3,FALSE)*FracLEACH*EFLRO*44/28","v":0},{"$f":"X23*0.01*44/28","v":0}]
[{"$f":"A22","v":"*"},null,null,null,null,null,"Dry Lot",null,"Pigs in deep litter sheds which have access to outdoor runs"]
[{"$f":"A24","v":"*"}]
[{"$f":"A25","v":"*"}]
[{"$f":"A24","v":"*"},null,null,null,null,null,"Free Range",null,"Pigs which do not have deep litter sheds"]
[{"$f":"A27","v":"*"}]
[{"$f":"A28","v":"*"}]
[{"$f":"A32","v":"*"},null,null,null,null,null,"Manure Collected",null,null,null,null,null,0.4]
[{"$f":"A30","v":"*"}]
[{"$f":"IF(AND(I20=\"Outdoor\",I22=\"Dry Lot\"),\"\",\"*\")","v":"*"},null,null,null,null,"Solids Usage",null,null,"Export Off-Site",null,null,null,null,null,null,null,null,"Adjustment",null,null,null,null,null,{"$f":"IF($I$32=\"Export Off-Site\",X23*-1,0)*$M$34","v":0},{"$f":"IF($I$32=\"Export Off-Site\",Y23*-1,0)*$M$34","v":0},{"$f":"IF($I$32=\"Export Off-Site\",Z23*-1,0)*$M$34","v":0},{"$f":"IF($I$32=\"Export Off-Site\",AA23*-1,0)*$M$34","v":0}]
[{"$f":"A32","v":"*"}]
[{"$f":"IF(AND(I20=\"Outdoor\",I22=\"Dry Lot\",I32=\"Export Off-Site\"),\"\",\"*\")","v":"*"},{"$f":"IF(I32<>\"Export Off-Site\",\"*\",\"\")","v":""},null,null,null,null,null,null,"% Exported Off Site",null,null,null,0.8]
[{"$f":"A34","v":"*"}]
[{"$f":"IF(I20=\"Indoor\",\"\",\"*\")","v":""},{"$f":"IF(AND(I20=\"Indoor\",I36=\"Solid\"),1,0)","v":1},null,null,null,"Collection System",null,null,"Solid",null,null,null,null,null,null,null,null,1,3,{"$f":"INDEX(TableG4MCF,MATCH(HomeState,States),'MMS2'!S36)*B36/100","v":1.4999999999999999E-2},{"$f":"EmmPot*'MMS2'!T36*DensCH4*R36","v":4.4685000000000002E-3},{"$f":"INDEX(Tale10,'MMS2'!S36)*44/28*B36*R36","v":3.1428571428571431E-2},{"$f":"INDEX(TableJ_1,S36)*AtmosDep*44/28*R36*B36","v":7.0714285714285714E-3},{"$f":"(1-INDEX(Tale10,'MMS2'!S36)-INDEX(TableJ_1,S36))*B36*R36","v":0.53},{"$f":"X36*VLOOKUP(HomeState,TableM2,3,FALSE)*FracLEACH","v":5.3265E-2},{"$f":"X36*VLOOKUP(HomeState,TableM2,3,FALSE)*FracLEACH*EFLRO*44/28","v":1.0462767857142858E-3},{"$f":"X36*0.01*44/28","v":8.3285714285714282E-3}]
[{"$f":"A36","v":""}]
[{"$f":"IF(AND(I20=\"Indoor\",I36=\"Solid\"),\"\",\"*\")","v":""},null,null,null,null,"Solids Usage",null,null,"Soil Application",null,null,null,null,null,null,null,null,{"$f":"R32","v":"Adjustment"},null,null,null,null,null,{"$f":"IF($I$38=\"Export Off-Site\",X36*-1,0)*$M$40","v":0},{"$f":"IF($I$38=\"Export Off-Site\",Y36*-1,0)*$M$40","v":0},{"$f":"IF($I$38=\"Export Off-Site\",Z36*-1,0)*$M$40","v":0},{"$f":"IF($I$38=\"Export Off-Site\",AA36*-1,0)*$M$40","v":0}]
[{"$f":"A38","v":""}]
[{"$f":"IF(AND(I36=\"Solid\",I38=\"Export Off-Site\"),\"\",\"*\")","v":"*"},null,null,null,null,null,null,null,"% Exported Off Site",null,null,null,0]
[{"$f":"A40","v":"*"}]
[{"$f":"IF(AND(I20=\"Indoor\",I36=\"Liquid\"),\"\",\"*\")","v":"*"},null,null,null,null,"Solid Extraction",null,null,"No Solids Separated"]
[{"$f":"A42","v":"*"}]
[{"$f":"A45","v":"*"},null,null,null,null,null,null,null,"Extracted",null,"VS",null,"N"]
[{"$f":"A46","v":"*"},{"$f":"IF(AND(I20=\"Indoor\",K45+M45<>0),1,0)","v":0},null,null,null,null,null,null,null,null,{"$f":"IF(I36=\"Liquid\",IF(ISERROR(VLOOKUP('MMS2'!$I$42,SolidExtVS_N,3,FALSE)),0,VLOOKUP('MMS2'!$I$42,SolidExtVS_N,3,FALSE)),0)","v":0},null,{"$f":"IF(I36=\"Liquid\",IF(ISERROR(VLOOKUP('MMS2'!$I$42,SolidExtVS_N,5,FALSE)),0,VLOOKUP('MMS2'!$I$42,SolidExtVS_N,5,FALSE)),0)","v":0},null,null,null,null,null,{"$f":"IF(I42=\"Effluent Daily Spread\",4,3)","v":3},{"$f":"INDEX(TableG4MCF,MATCH(HomeState,States),'MMS2'!S45)*B45/100","v":0},{"$f":"EmmPot*'MMS2'!T45*DensCH4*K45*B45","v":0},{"$f":"INDEX(Tale10,'MMS2'!S45)*44/28*B45*M45","v":0},{"$f":"INDEX(TableJ_1,S45)*AtmosDep*44/28*M45*B45","v":0},{"$f":"(1-INDEX(Tale10,'MMS2'!S45)-INDEX(TableJ_1,S45))*B45*M45","v":0},{"$f":"X45*VLOOKUP(HomeState,TableM2,3,FALSE)*FracLEACH","v":0},{"$f":"X45*VLOOKUP(HomeState,TableM2,3,FALSE)*FracLEACH*EFLRO*44/28","v":0},{"$f":"X45*0.01*44/28","v":0}]
[{"$f":"A47","v":"*"}]
[{"$f":"IF(AND(I20=\"Indoor\",K45+M45<>0),\"\",\"*\")","v":"*"},null,null,null,null,"Solids Usage",null,null,"Export Off-Site",null,null,null,null,null,null,null,null,{"$f":"R38","v":"Adjustment"},null,null,{"$f":"IF($I$47=\"Export Off-Site\",U45*-1,0)*$M$49","v":0},0,{"$f":"IF($I$47=\"Export Off-Site\",W45*-1,0)*$M$49","v":0},{"$f":"IF(I47=\"Export Off-Site\",X45*-1,0)*M49","v":0},{"$f":"IF($I$47=\"Export Off-Site\",Y45*-1,0)*$M$49","v":0},{"$f":"IF($I$47=\"Export Off-Site\",Z45*-1,0)*$M$49","v":0},{"$f":"IF($I$47=\"Export Off-Site\",AA45*-1,0)*$M$49","v":0}]
[{"$f":"A47","v":"*"}]
[{"$f":"IF(AND(I20=\"Indoor\",K45+M45<>0,I47=\"Export Off-Site\"),\"\",\"*\")","v":"*"},null,null,null,null,null,null,null,"% Exported Off Site",null,null,null,0.2]
[{"$f":"A49","v":"*"}]
[{"$f":"IF(AND(I20=\"Indoor\",I36=\"Liquid\"),\"\",\"*\")","v":"*"},null,null,null,null,"Liquid Treatment",null,null,"Digester"]
[{"$f":"A51","v":"*"}]
[{"$f":"A52","v":"*"},null,null,null,null,null,null,null,"Balance",null,"VS",null,"N"]
[{"$f":"A53","v":"*"},{"$f":"IF(AND(I36=\"Liquid\",I20=\"Indoor\",K54+M54<>0),1,0)","v":0},null,null,null,null,null,null,"Balance",null,{"$f":"1-K45","v":1},null,{"$f":"1-M45","v":1},null,null,null,null,null,{"$f":"MATCH(I51,EffTreatment,0)","v":5},{"$f":"INDEX(TableG4MCF,MATCH(HomeState,States),'MMS2'!S54)*B54/100","v":0},{"$f":"EmmPot*'MMS2'!T54*DensCH4*K54","v":0},{"$f":"INDEX(Tale10,'MMS2'!S54)*44/28*B54*M54","v":0},{"$f":"INDEX(TableJ_1,S54)*AtmosDep*44/28*M54*B54","v":0},{"$f":"(1-INDEX(Tale10,'MMS2'!S54)-INDEX(TableJ_1,S54))*B54*M54","v":0},{"$f":"X54*VLOOKUP(HomeState,TableM2,3,FALSE)*FracLEACH","v":0},{"$f":"X54*VLOOKUP(HomeState,TableM2,3,FALSE)*FracLEACH*EFLRO*44/28","v":0},{"$f":"X54*0.01*44/28","v":0}]
[{"$f":"A54","v":"*"}]
[{"$f":"A55","v":"*"},null,null,null,null,"Treated Effluent Use",null,null,"Soil Application",null,null,null,null,null,null,null,null,{"$f":"R47","v":"Adjustment"},null,null,null,null,null,{"$f":"IF(I56=\"Export Off-Site\",X54*-1,0)*M58","v":0},{"$f":"IF(I56=\"Export Off-Site\",Y54*-1,0)*M58","v":0},{"$f":"IF($I$56=\"Export Off-Site\",Z54*-1,0)*$M$58","v":0},{"$f":"IF($I$56=\"Export Off-Site\",AA54*-1,0)*$M$58","v":0}]
[{"$f":"A58","v":"*"}]
[{"$f":"IF(AND(I56=\"Export Off-Site\",I20=\"Indoor\",I36=\"Liquid\"),\"\",\"*\")","v":"*"},null,null,null,null,null,null,null,"% Exported Off Site",null,null,null,0.2]
[]
[]
[]
[]
[null,null,null,null,null,null,null,null,null,null,null,null,null,null,null,null,null,"Export",null,null,{"$f":"SUMIF(U6:U61,\"<0\",U6:U61)","v":0},{"$f":"SUMIF(V6:V61,\"<0\",V6:V61)","v":0},{"$f":"SUMIF(W6:W61,\"<0\",W6:W61)","v":0},null,null,{"$f":"SUMIF(Z6:Z61,\"<0\",Z6:Z61)","v":0},{"$f":"SUMIF(AA6:AA61,\"<0\",AA6:AA61)","v":0}]
[null,null,null,null,null,null,null,null,null,null,null,null,null,null,null,null,null,null,null,null,{"$f":"K10","v":21},{"$f":"K11","v":310},{"$f":"K12","v":310},null,null,{"$f":"K13","v":310},{"$f":"K14","v":310}]
[null,null,null,null,null,null,null,null,null,null,null,null,null,null,null,null,null,"Export C02-e",null,null,{"$f":"U64*U63","v":0},{"$f":"V64*V63","v":0},0,null,null,0,0]

{"sheet":"MMS3","index":18,"n_rows":65,"n_cols":27,"rows_kept":65,"cut":false,"hidden":false,"merged":[[57,8,57,10],[46,5,46,6],[46,8,46,12],[48,8,48,10],[52,8,53,8],[55,5,55,6],[55,8,55,12],[50,5,50,6],[50,8,50,12],[35,8,35,12],[37,5,37,6],[37,8,37,12],[39,8,39,10],[43,8,44,8],[41,5,41,6],[41,8,41,12],[35,5,35,6],[26,8,27,12],[29,6,29,10],[31,5,31,6],[31,8,31,12],[33,8,33,10],[21,5,21,6],[21,8,21,12],[23,8,24,12],[3,5,4,12],[6,5,6,6],[6,8,6,12],[15,8,17,9],[19,5,19,6],[19,8,19,10]]}
["Hide"]
[null,null,null,null,null,null,null,null,null,null,null,null,null,null,null,null,null,null,null,null,"4B.8_1","4B.8_4","4B.1.a_10c",null,"4D3_6","4D3_6"]
[null,null,null,null,null,null,null,null,null,null,null,null,null,null,null,null,null,null,null,null,null,null,"4D3_4",null,null,"4D3_7"]
[null,null,null,null,null,"Manure Management System 1",null,null,null,null,null,null,null,null,null,null,null,null,null,null,"MMS-VS","MMS Direct","MMS -N Vol","Residual","LRO ","LRO","SOIL N20"]
[null,null,null,null,null,null,null,null,null,null,null,null,null,null,null,null,null,null,"MMS","MCF","CH4","N2O","N2O","N","N","N2O","N2O"]
[]
[null,null,null,null,null,"MMS3 Name",null,null,"Ponds II"]
[]
[null,null,null,null,null,null,null,null,"Total",null,"x Factor",null,"CO2e"]
[null,null,null,null,null,null,"CH4",null,{"$f":"SUM(U22:U58)","v":2.9790000000000004E-2},null,{"$f":"CFCH4","v":21},null,{"$f":"K10*I10","v":0.62559000000000009}]
[null,null,null,null,null,null,"N2O Dir.",null,{"$f":"SUM(V22:V58)","v":1.5714285714285713E-3},null,{"$f":"CFN2O","v":310},null,{"$f":"K11*I11","v":0.4871428571428571}]
[null,null,null,null,null,null,"N2O Vol.",null,{"$f":"SUM(W22:W58)","v":0},null,{"$f":"CFN2O","v":310},null,{"$f":"K12*I12","v":0}]
[null,null,null,null,null,null,"N2O LRO",null,{"$f":"SUM(Z22:Z58)","v":1.9721330357142862E-3},null,{"$f":"CFN2O","v":310},null,{"$f":"K13*I13","v":0.61136124107142875}]
[null,null,null,null,null,null,"N20 Soil",null,{"$f":"SUM(AA22:AA58)","v":1.569857142857143E-2},null,{"$f":"CFN2O","v":310},null,{"$f":"K14*I14","v":4.8665571428571432}]
[]
[null,null,null,null,null,null,null,null,"Exported Manure",null,"N2O",null,{"$f":"SUM(V65:AA65)","v":0}]
[]
[null,null,null,null,null,null,null,null,null,null,"CH4",null,{"$f":"U65","v":0}]
[]
[null,null,null,null,null,"Production Type",null,null,"Indoor"]
[]
[{"$f":"IF(I20=\"Outdoor\",\"\",\"*\")","v":"*"},{"$f":"IF(A22=\"*\",0,1)","v":0},null,null,null,"Production System",null,null,"Dry Lot",null,null,null,null,null,null,null,{"$f":"INDEX(Assumption!$C$75:$G$75,S22)","v":"Daily Spread\n(%)"},{"$f":"IF($I$22=\"Free Range\",1,1-M30)","v":0.6},4,{"$f":"INDEX(TableG4MCF,MATCH(HomeState,States),'MMS3'!S22)*B22/100","v":0},{"$f":"EmmPot*'MMS3'!T22*DensCH4*R22","v":0},{"$f":"INDEX(Tale10,'MMS3'!S22)*44/28*B22*R22","v":0},{"$f":"INDEX(TableJ_1,S22)*AtmosDep*44/28*R22*B22","v":0},{"$f":"(1-INDEX(Tale10,'MMS3'!S22)-INDEX(TableJ_1,S22))*B22*R22","v":0},{"$f":"X22*VLOOKUP(HomeState,TableM2,3,FALSE)*FracLEACH","v":0},{"$f":"X22*VLOOKUP(HomeState,TableM2,3,FALSE)*FracLEACH*EFLRO*44/28","v":0},{"$f":"X22*0.01*44/28","v":0}]
[{"$f":"A22","v":"*"},{"$f":"B22","v":0},null,null,null,null,null,null,null,null,null,null,null,null,null,null,{"$f":"INDEX(Assumption!$C$75:$G$75,S23)","v":"Drylot\n(%)"},{"$f":"IF($I$22=\"Free Range\",0,M30)","v":0.4},3,{"$f":"INDEX(TableG4MCF,MATCH(HomeState,States),'MMS3'!S23)*B23/100","v":0},{"$f":"EmmPot*'MMS3'!T23*DensCH4*R23","v":0},{"$f":"INDEX(Tale10,'MMS3'!S23)*44/28*B23*R23","v":0},{"$f":"INDEX(TableJ_1,S23)*AtmosDep*44/28*R23*B23","v":0},{"$f":"(1-INDEX(Tale10,'MMS3'!S23)-INDEX(TableJ_1,S23))*B23*R23","v":0},{"$f":"X23*VLOOKUP(HomeState,TableM2,3,FALSE)*FracLEACH","v":0},{"$f":"X23*VLOOKUP(HomeState,TableM2,3,FALSE)*FracLEACH*EFLRO*44/28","v":0},{"$f":"X23*0.01*44/28","v":0}]
[{"$f":"A22","v":"*"},null,null,null,null,null,"Dry Lot",null,"Pigs in deep litter sheds which have access to outdoor runs"]
[{"$f":"A24","v":"*"}]
[{"$f":"A25","v":"*"}]
[{"$f":"A24","v":"*"},null,null,null,null,null,"Free Range",null,"Pigs which do not have deep litter sheds"]
[{"$f":"A27","v":"*"}]
[{"$f":"A28","v":"*"}]
[{"$f":"A32","v":"*"},null,null,null,null,null,"Manure Collected",null,null,null,null,null,0.4]
[{"$f":"A30","v":"*"}]
[{"$f":"IF(AND(I20=\"Outdoor\",I22=\"Dry Lot\"),\"\",\"*\")","v":"*"},null,null,null,null,"Solids Usage",null,null,"Export Off-Site",null,null,null,null,null,null,null,null,"Adjustment",null,null,null,null,null,{"$f":"IF($I$32=\"Export Off-Site\",X23*-1,0)*$M$34","v":0},{"$f":"IF($I$32=\"Export Off-Site\",Y23*-1,0)*$M$34","v":0},{"$f":"IF($I$32=\"Export Off-Site\",Z23*-1,0)*$M$34","v":0},{"$f":"IF($I$32=\"Export Off-Site\",AA23*-1,0)*$M$34","v":0}]
[{"$f":"A32","v":"*"}]
[{"$f":"IF(AND(I20=\"Outdoor\",I22=\"Dry Lot\",I32=\"Export Off-Site\"),\"\",\"*\")","v":"*"},{"$f":"IF(I32<>\"Export Off-Site\",\"*\",\"\")","v":""},null,null,null,null,null,null,"% Exported Off Site",null,null,null,0.8]
[{"$f":"A34","v":"*"}]
[{"$f":"IF(I20=\"Indoor\",\"\",\"*\")","v":""},{"$f":"IF(AND(I20=\"Indoor\",I36=\"Solid\"),1,0)","v":0},null,null,null,"Collection System",null,null,"Liquid",null,null,null,null,null,null,null,null,1,3,{"$f":"INDEX(TableG4MCF,MATCH(HomeState,States),'MMS3'!S36)*B36/100","v":0},{"$f":"EmmPot*'MMS3'!T36*DensCH4*R36","v":0},{"$f":"INDEX(Tale10,'MMS3'!S36)*44/28*B36*R36","v":0},{"$f":"INDEX(TableJ_1,S36)*AtmosDep*44/28*R36*B36","v":0},{"$f":"(1-INDEX(Tale10,'MMS3'!S36)-INDEX(TableJ_1,S36))*B36*R36","v":0},{"$f":"X36*VLOOKUP(HomeState,TableM2,3,FALSE)*FracLEACH","v":0},{"$f":"X36*VLOOKUP(HomeState,TableM2,3,FALSE)*FracLEACH*EFLRO*44/28","v":0},{"$f":"X36*0.01*44/28","v":0}]
[{"$f":"A36","v":""}]
[{"$f":"IF(AND(I20=\"Indoor\",I36=\"Solid\"),\"\",\"*\")","v":"*"},null,null,null,null,"Solids Usage",null,null,"Export Off-Site",null,null,null,null,null,null,null,null,{"$f":"R32","v":"Adjustment"},null,null,null,null,null,{"$f":"IF($I$38=\"Export Off-Site\",X36*-1,0)*$M$40","v":0},{"$f":"IF($I$38=\"Export Off-Site\",Y36*-1,0)*$M$40","v":0},{"$f":"IF($I$38=\"Export Off-Site\",Z36*-1,0)*$M$40","v":0},{"$f":"IF($I$38=\"Export Off-Site\",AA36*-1,0)*$M$40","v":0}]
[{"$f":"A38","v":"*"}]
[{"$f":"IF(AND(I36=\"Solid\",I38=\"Export Off-Site\"),\"\",\"*\")","v":"*"},null,null,null,null,null,null,null,"% Exported Off Site",null,null,null,0.5]
[{"$f":"A40","v":"*"}]
[{"$f":"IF(AND(I20=\"Indoor\",I36=\"Liquid\"),\"\",\"*\")","v":""},null,null,null,null,"Solid Extraction",null,null,"No Solids Separated"]
[{"$f":"A42","v":""}]
[{"$f":"A45","v":"*"},null,null,null,null,null,null,null,"Extracted",null,"VS",null,"N"]
[{"$f":"A46","v":"*"},{"$f":"IF(AND(I20=\"Indoor\",K45+M45<>0),1,0)","v":0},null,null,null,null,null,null,null,null,{"$f":"IF(I36=\"Liquid\",IF(ISERROR(VLOOKUP('MMS3'!$I$42,SolidExtVS_N,3,FALSE)),0,VLOOKUP('MMS3'!$I$42,SolidExtVS_N,3,FALSE)),0)","v":0},null,{"$f":"IF(I36=\"Liquid\",IF(ISERROR(VLOOKUP('MMS3'!$I$42,SolidExtVS_N,5,FALSE)),0,VLOOKUP('MMS3'!$I$42,SolidExtVS_N,5,FALSE)),0)","v":0},null,null,null,null,null,{"$f":"IF(I42=\"Effluent Daily Spread\",4,3)","v":3},{"$f":"INDEX(TableG4MCF,MATCH(HomeState,States),'MMS3'!S45)*B45/100","v":0},{"$f":"EmmPot*'MMS3'!T45*DensCH4*K45*B45","v":0},{"$f":"INDEX(Tale10,'MMS3'!S45)*44/28*B45*M45","v":0},{"$f":"INDEX(TableJ_1,S45)*AtmosDep*44/28*M45*B45","v":0},{"$f":"(1-INDEX(Tale10,'MMS3'!S45)-INDEX(TableJ_1,S45))*B45*M45","v":0},{"$f":"X45*VLOOKUP(HomeState,TableM2,3,FALSE)*FracLEACH","v":0},{"$f":"X45*VLOOKUP(HomeState,TableM2,3,FALSE)*FracLEACH*EFLRO*44/28","v":0},{"$f":"X45*0.01*44/28","v":0}]
[{"$f":"A47","v":"*"}]
[{"$f":"IF(AND(I20=\"Indoor\",K45+M45<>0),\"\",\"*\")","v":"*"},null,null,null,null,"Solids Usage",null,null,"Soil Application",null,null,null,null,null,null,null,null,{"$f":"R38","v":"Adjustment"},null,null,{"$f":"IF($I$47=\"Export Off-Site\",U45*-1,0)*$M$49","v":0},0,{"$f":"IF($I$47=\"Export Off-Site\",W45*-1,0)*$M$49","v":0},{"$f":"IF(I47=\"Export Off-Site\",X45*-1,0)*M49","v":0},{"$f":"IF($I$47=\"Export Off-Site\",Y45*-1,0)*$M$49","v":0},{"$f":"IF($I$47=\"Export Off-Site\",Z45*-1,0)*$M$49","v":0},{"$f":"IF($I$47=\"Export Off-Site\",AA45*-1,0)*$M$49","v":0}]
[{"$f":"A47","v":"*"}]
[{"$f":"IF(AND(I20=\"Indoor\",K45+M45<>0,I47=\"Export Off-Site\"),\"\",\"*\")","v":"*"},null,null,null,null,null,null,null,"% Exported Off Site",null,null,null,0.2]
[{"$f":"A49","v":"*"}]
[{"$f":"IF(AND(I20=\"Indoor\",I36=\"Liquid\"),\"\",\"*\")","v":""},null,null,null,null,"Liquid Treatment",null,null,"Digester"]
[{"$f":"A51","v":""}]
[{"$f":"A52","v":""},null,null,null,null,null,null,null,"Balance",null,"VS",null,"N"]
[{"$f":"A53","v":""},{"$f":"IF(AND(I36=\"Liquid\",I20=\"Indoor\",K54+M54<>0),1,0)","v":1},null,null,null,null,null,null,"Balance",null,{"$f":"1-K45","v":1},null,{"$f":"1-M45","v":1},null,null,null,null,null,{"$f":"MATCH(I51,EffTreatment,0)","v":5},{"$f":"INDEX(TableG4MCF,MATCH(HomeState,States),'MMS3'!S54)*B54/100","v":0.1},{"$f":"EmmPot*'MMS3'!T54*DensCH4*K54","v":2.9790000000000004E-2},{"$f":"INDEX(Tale10,'MMS3'!S54)*44/28*B54*M54","v":1.5714285714285713E-3},{"$f":"INDEX(TableJ_1,S54)*AtmosDep*44/28*M54*B54","v":0},{"$f":"(1-INDEX(Tale10,'MMS3'!S54)-INDEX(TableJ_1,S54))*B54*M54","v":0.999},{"$f":"X54*VLOOKUP(HomeState,TableM2,3,FALSE)*FracLEACH","v":0.10039950000000002},{"$f":"X54*VLOOKUP(HomeState,TableM2,3,FALSE)*FracLEACH*EFLRO*44/28","v":1.9721330357142862E-3},{"$f":"X54*0.01*44/28","v":1.569857142857143E-2}]
[{"$f":"A54","v":""}]
[{"$f":"A55","v":""},null,null,null,null,"Treated Effluent Use",null,null,"Soil Application",null,null,null,null,null,null,null,null,{"$f":"R47","v":"Adjustment"},null,null,null,null,null,{"$f":"IF(I56=\"Export Off-Site\",X54*-1,0)*M58","v":0},{"$f":"IF(I56=\"Export Off-Site\",Y54*-1,0)*M58","v":0},{"$f":"IF($I$56=\"Export Off-Site\",Z54*-1,0)*$M$58","v":0},{"$f":"IF($I$56=\"Export Off-Site\",AA54*-1,0)*$M$58","v":0}]
[{"$f":"A58","v":"*"}]
[{"$f":"IF(AND(I56=\"Export Off-Site\",I20=\"Indoor\",I36=\"Liquid\"),\"\",\"*\")","v":"*"},null,null,null,null,null,null,null,"% Exported Off Site",null,null,null,0.2]
[]
[]
[]
[]
[null,null,null,null,null,null,null,null,null,null,null,null,null,null,null,null,null,"Export",null,null,{"$f":"SUMIF(U6:U61,\"<0\",U6:U61)","v":0},{"$f":"SUMIF(V6:V61,\"<0\",V6:V61)","v":0},{"$f":"SUMIF(W6:W61,\"<0\",W6:W61)","v":0},null,null,{"$f":"SUMIF(Z6:Z61,\"<0\",Z6:Z61)","v":0},{"$f":"SUMIF(AA6:AA61,\"<0\",AA6:AA61)","v":0}]
[null,null,null,null,null,null,null,null,null,null,null,null,null,null,null,null,null,null,null,null,{"$f":"K10","v":21},{"$f":"K11","v":310},{"$f":"K12","v":310},null,null,{"$f":"K13","v":310},{"$f":"K14","v":310}]
[null,null,null,null,null,null,null,null,null,null,null,null,null,null,null,null,null,"Export C02-e",null,null,{"$f":"U64*U63","v":0},{"$f":"V64*V63","v":0},0,null,null,0,0]

{"sheet":"MMS4","index":19,"n_rows":65,"n_cols":27,"rows_kept":65,"cut":false,"hidden":false,"merged":[[57,8,57,10],[46,5,46,6],[46,8,46,12],[48,8,48,10],[52,8,53,8],[55,5,55,6],[55,8,55,12],[50,5,50,6],[50,8,50,12],[35,8,35,12],[37,5,37,6],[37,8,37,12],[39,8,39,10],[43,8,44,8],[41,5,41,6],[41,8,41,12],[35,5,35,6],[26,8,27,12],[29,6,29,10],[31,5,31,6],[31,8,31,12],[33,8,33,10],[21,5,21,6],[21,8,21,12],[23,8,24,12],[3,5,4,12],[6,5,6,6],[6,8,6,12],[15,8,17,9],[19,5,19,6],[19,8,19,10]]}
["Hide"]
[null,null,null,null,null,null,null,null,null,null,null,null,null,null,null,null,null,null,null,null,"4B.8_1","4B.8_4","4B.1.a_10c",null,"4D3_6","4D3_6"]
[null,null,null,null,null,null,null,null,null,null,null,null,null,null,null,null,null,null,null,null,null,null,"4D3_4",null,null,"4D3_7"]
[null,null,null,null,null,"Manure Management System 1",null,null,null,null,null,null,null,null,null,null,null,null,null,null,"MMS-VS","MMS Direct","MMS -N Vol","Residual","LRO ","LRO","SOIL N20"]
[null,null,null,null,null,null,null,null,null,null,null,null,null,null,null,null,null,null,"MMS","MCF","CH4","N2O","N2O","N","N","N2O","N2O"]
[]
[null,null,null,null,null,"MMS4 Name",null,null,"Not Used"]
[]
[null,null,null,null,null,null,null,null,"Total",null,"x Factor",null,"CO2e"]
[null,null,null,null,null,null,"CH4",null,{"$f":"SUM(U22:U58)","v":0.26811000000000001},null,{"$f":"CFCH4","v":21},null,{"$f":"K10*I10","v":5.6303100000000006}]
[null,null,null,null,null,null,"N2O Dir.",null,{"$f":"SUM(V22:V58)","v":1.5714285714285713E-3},null,{"$f":"CFN2O","v":310},null,{"$f":"K11*I11","v":0.4871428571428571}]
[null,null,null,null,null,null,"N2O Vol.",null,{"$f":"SUM(W22:W58)","v":6.2857142857142851E-3},null,{"$f":"CFN2O","v":310},null,{"$f":"K12*I12","v":1.9485714285714284}]
[null,null,null,null,null,null,"N2O LRO",null,{"$f":"SUM(Z22:Z58)","v":1.1824901785714285E-3},null,{"$f":"CFN2O","v":310},null,{"$f":"K13*I13","v":0.36657195535714282}]
[null,null,null,null,null,null,"N20 Soil",null,{"$f":"SUM(AA22:AA58)","v":9.4128571428571412E-3},null,{"$f":"CFN2O","v":310},null,{"$f":"K14*I14","v":2.917985714285714}]
[]
[null,null,null,null,null,null,null,null,"Exported Manure",null,"N2O",null,{"$f":"SUM(V65:AA65)","v":0}]
[]
[null,null,null,null,null,null,null,null,null,null,"CH4",null,{"$f":"U65","v":0}]
[]
[null,null,null,null,null,"Production Type",null,null,"Indoor"]
[]
[{"$f":"IF(I20=\"Outdoor\",\"\",\"*\")","v":"*"},{"$f":"IF(A22=\"*\",0,1)","v":0},null,null,null,"Production System",null,null,"Dry Lot",null,null,null,null,null,null,null,{"$f":"INDEX(Assumption!$C$75:$G$75,S22)","v":"Daily Spread\n(%)"},{"$f":"IF($I$22=\"Free Range\",1,1-M30)","v":0.6},4,{"$f":"INDEX(TableG4MCF,MATCH(HomeState,States),'MMS4'!S22)*B22/100","v":0},{"$f":"EmmPot*'MMS4'!T22*DensCH4*R22","v":0},{"$f":"INDEX(Tale10,'MMS4'!S22)*44/28*B22*R22","v":0},{"$f":"INDEX(TableJ_1,S22)*AtmosDep*44/28*R22*B22","v":0},{"$f":"(1-INDEX(Tale10,'MMS4'!S22)-INDEX(TableJ_1,S22))*B22*R22","v":0},{"$f":"X22*VLOOKUP(HomeState,TableM2,3,FALSE)*FracLEACH","v":0},{"$f":"X22*VLOOKUP(HomeState,TableM2,3,FALSE)*FracLEACH*EFLRO*44/28","v":0},{"$f":"X22*0.01*44/28","v":0}]
[{"$f":"A22","v":"*"},{"$f":"B22","v":0},null,null,null,null,null,null,null,null,null,null,null,null,null,null,{"$f":"INDEX(Assumption!$C$75:$G$75,S23)","v":"Drylot\n(%)"},{"$f":"IF($I$22=\"Free Range\",0,M30)","v":0.4},3,{"$f":"INDEX(TableG4MCF,MATCH(HomeState,States),'MMS4'!S23)*B23/100","v":0},{"$f":"EmmPot*'MMS4'!T23*DensCH4*R23","v":0},{"$f":"INDEX(Tale10,'MMS4'!S23)*44/28*B23*R23","v":0},{"$f":"INDEX(TableJ_1,S23)*AtmosDep*44/28*R23*B23","v":0},{"$f":"(1-INDEX(Tale10,'MMS4'!S23)-INDEX(TableJ_1,S23))*B23*R23","v":0},{"$f":"X23*VLOOKUP(HomeState,TableM2,3,FALSE)*FracLEACH","v":0},{"$f":"X23*VLOOKUP(HomeState,TableM2,3,FALSE)*FracLEACH*EFLRO*44/28","v":0},{"$f":"X23*0.01*44/28","v":0}]
[{"$f":"A22","v":"*"},null,null,null,null,null,"Dry Lot",null,"Pigs in deep litter sheds which have access to outdoor runs"]
[{"$f":"A24","v":"*"}]
[{"$f":"A25","v":"*"}]
[{"$f":"A24","v":"*"},null,null,null,null,null,"Free Range",null,"Pigs which do not have deep litter sheds"]
[{"$f":"A27","v":"*"}]
[{"$f":"A28","v":"*"}]
[{"$f":"A32","v":"*"},null,null,null,null,null,"Manure Collected",null,null,null,null,null,0.4]
[{"$f":"A30","v":"*"}]
[{"$f":"IF(AND(I20=\"Outdoor\",I22=\"Dry Lot\"),\"\",\"*\")","v":"*"},null,null,null,null,"Solids Usage",null,null,"Export Off-Site",null,null,null,null,null,null,null,null,"Adjustment",null,null,null,null,null,{"$f":"IF($I$32=\"Export Off-Site\",X23*-1,0)*$M$34","v":0},{"$f":"IF($I$32=\"Export Off-Site\",Y23*-1,0)*$M$34","v":0},{"$f":"IF($I$32=\"Export Off-Site\",Z23*-1,0)*$M$34","v":0},{"$f":"IF($I$32=\"Export Off-Site\",AA23*-1,0)*$M$34","v":0}]
[{"$f":"A32","v":"*"}]
[{"$f":"IF(AND(I20=\"Outdoor\",I22=\"Dry Lot\",I32=\"Export Off-Site\"),\"\",\"*\")","v":"*"},{"$f":"IF(I32<>\"Export Off-Site\",\"*\",\"\")","v":""},null,null,null,null,null,null,"% Exported Off Site",null,null,null,0.8]
[{"$f":"A34","v":"*"}]
[{"$f":"IF(I20=\"Indoor\",\"\",\"*\")","v":""},{"$f":"IF(AND(I20=\"Indoor\",I36=\"Solid\"),1,0)","v":0},null,null,null,"Collection System",null,null,"Liquid",null,null,null,null,null,null,null,null,1,3,{"$f":"INDEX(TableG4MCF,MATCH(HomeState,States),'MMS4'!S36)*B36/100","v":0},{"$f":"EmmPot*'MMS4'!T36*DensCH4*R36","v":0},{"$f":"INDEX(Tale10,'MMS4'!S36)*44/28*B36*R36","v":0},{"$f":"INDEX(TableJ_1,S36)*AtmosDep*44/28*R36*B36","v":0},{"$f":"(1-INDEX(Tale10,'MMS4'!S36)-INDEX(TableJ_1,S36))*B36*R36","v":0},{"$f":"X36*VLOOKUP(HomeState,TableM2,3,FALSE)*FracLEACH","v":0},{"$f":"X36*VLOOKUP(HomeState,TableM2,3,FALSE)*FracLEACH*EFLRO*44/28","v":0},{"$f":"X36*0.01*44/28","v":0}]
[{"$f":"A36","v":""}]
[{"$f":"IF(AND(I20=\"Indoor\",I36=\"Solid\"),\"\",\"*\")","v":"*"},null,null,null,null,"Solids Usage",null,null,"Export Off-Site",null,null,null,null,null,null,null,null,{"$f":"R32","v":"Adjustment"},null,null,null,null,null,{"$f":"IF($I$38=\"Export Off-Site\",X36*-1,0)*$M$40","v":0},{"$f":"IF($I$38=\"Export Off-Site\",Y36*-1,0)*$M$40","v":0},{"$f":"IF($I$38=\"Export Off-Site\",Z36*-1,0)*$M$40","v":0},{"$f":"IF($I$38=\"Export Off-Site\",AA36*-1,0)*$M$40","v":0}]
[{"$f":"A38","v":"*"}]
[{"$f":"IF(AND(I36=\"Solid\",I38=\"Export Off-Site\"),\"\",\"*\")","v":"*"},null,null,null,null,null,null,null,"% Exported Off Site",null,null,null,0.5]
[{"$f":"A40","v":"*"}]
[{"$f":"IF(AND(I20=\"Indoor\",I36=\"Liquid\"),\"\",\"*\")","v":""},null,null,null,null,"Solid Extraction",null,null,"No Solids Seperated"]
[{"$f":"A42","v":""}]
[{"$f":"A45","v":"*"},null,null,null,null,null,null,null,"Extracted",null,"VS",null,"N"]
[{"$f":"A46","v":"*"},{"$f":"IF(AND(I20=\"Indoor\",K45+M45<>0),1,0)","v":0},null,null,null,null,null,null,null,null,{"$f":"IF(I36=\"Liquid\",IF(ISERROR(VLOOKUP('MMS4'!$I$42,SolidExtVS_N,3,FALSE)),0,VLOOKUP('MMS4'!$I$42,SolidExtVS_N,3,FALSE)),0)","v":0},null,{"$f":"IF(I36=\"Liquid\",IF(ISERROR(VLOOKUP('MMS4'!$I$42,SolidExtVS_N,5,FALSE)),0,VLOOKUP('MMS4'!$I$42,SolidExtVS_N,5,FALSE)),0)","v":0},null,null,null,null,null,{"$f":"IF(I42=\"Effluent Daily Spread\",4,3)","v":3},{"$f":"INDEX(TableG4MCF,MATCH(HomeState,States),'MMS4'!S45)*B45/100","v":0},{"$f":"EmmPot*'MMS4'!T45*DensCH4*K45*B45","v":0},{"$f":"INDEX(Tale10,'MMS4'!S45)*44/28*B45*M45","v":0},{"$f":"INDEX(TableJ_1,S45)*AtmosDep*44/28*M45*B45","v":0},{"$f":"(1-INDEX(Tale10,'MMS4'!S45)-INDEX(TableJ_1,S45))*B45*M45","v":0},{"$f":"X45*VLOOKUP(HomeState,TableM2,3,FALSE)*FracLEACH","v":0},{"$f":"X45*VLOOKUP(HomeState,TableM2,3,FALSE)*FracLEACH*EFLRO*44/28","v":0},{"$f":"X45*0.01*44/28","v":0}]
[{"$f":"A47","v":"*"}]
[{"$f":"IF(AND(I20=\"Indoor\",K45+M45<>0),\"\",\"*\")","v":"*"},null,null,null,null,"Solids Usage",null,null,"Export Off-Site",null,null,null,null,null,null,null,null,{"$f":"R38","v":"Adjustment"},null,null,{"$f":"IF($I$47=\"Export Off-Site\",U45*-1,0)*$M$49","v":0},0,{"$f":"IF($I$47=\"Export Off-Site\",W45*-1,0)*$M$49","v":0},{"$f":"IF(I47=\"Export Off-Site\",X45*-1,0)*M49","v":0},{"$f":"IF($I$47=\"Export Off-Site\",Y45*-1,0)*$M$49","v":0},{"$f":"IF($I$47=\"Export Off-Site\",Z45*-1,0)*$M$49","v":0},{"$f":"IF($I$47=\"Export Off-Site\",AA45*-1,0)*$M$49","v":0}]
[{"$f":"A47","v":"*"}]
[{"$f":"IF(AND(I20=\"Indoor\",K45+M45<>0,I47=\"Export Off-Site\"),\"\",\"*\")","v":"*"},null,null,null,null,null,null,null,"% Exported Off Site",null,null,null,0.2]
[{"$f":"A49","v":"*"}]
[{"$f":"IF(AND(I20=\"Indoor\",I36=\"Liquid\"),\"\",\"*\")","v":""},null,null,null,null,"Liquid Treatment",null,null,"Anaerobic Lagoon"]
[{"$f":"A51","v":""}]
[{"$f":"A52","v":""},null,null,null,null,null,null,null,"Balance",null,"VS",null,"N"]
[{"$f":"A53","v":""},{"$f":"IF(AND(I36=\"Liquid\",I20=\"Indoor\",K54+M54<>0),1,0)","v":1},null,null,null,null,null,null,"Balance",null,{"$f":"1-K45","v":1},null,{"$f":"1-M45","v":1},null,null,null,null,null,{"$f":"MATCH(I51,EffTreatment,0)","v":1},{"$f":"INDEX(TableG4MCF,MATCH(HomeState,States),'MMS4'!S54)*B54/100","v":0.9},{"$f":"EmmPot*'MMS4'!T54*DensCH4*K54","v":0.26811000000000001},{"$f":"INDEX(Tale10,'MMS4'!S54)*44/28*B54*M54","v":1.5714285714285713E-3},{"$f":"INDEX(TableJ_1,S54)*AtmosDep*44/28*M54*B54","v":6.2857142857142851E-3},{"$f":"(1-INDEX(Tale10,'MMS4'!S54)-INDEX(TableJ_1,S54))*B54*M54","v":0.59899999999999998},{"$f":"X54*VLOOKUP(HomeState,TableM2,3,FALSE)*FracLEACH","v":6.0199500000000003E-2},{"$f":"X54*VLOOKUP(HomeState,TableM2,3,FALSE)*FracLEACH*EFLRO*44/28","v":1.1824901785714285E-3},{"$f":"X54*0.01*44/28","v":9.4128571428571412E-3}]
[{"$f":"A54","v":""}]
[{"$f":"A55","v":""},null,null,null,null,"Treated Effluent Use",null,null,"Soil Application",null,null,null,null,null,null,null,null,{"$f":"R47","v":"Adjustment"},null,null,null,null,null,{"$f":"IF(I56=\"Export Off-Site\",X54*-1,0)*M58","v":0},{"$f":"IF(I56=\"Export Off-Site\",Y54*-1,0)*M58","v":0},{"$f":"IF($I$56=\"Export Off-Site\",Z54*-1,0)*$M$58","v":0},{"$f":"IF($I$56=\"Export Off-Site\",AA54*-1,0)*$M$58","v":0}]
[{"$f":"A58","v":"*"}]
[{"$f":"IF(AND(I56=\"Export Off-Site\",I20=\"Indoor\",I36=\"Liquid\"),\"\",\"*\")","v":"*"},null,null,null,null,null,null,null,"% Exported Off Site",null,null,null,0.2]
[]
[]
[]
[]
[null,null,null,null,null,null,null,null,null,null,null,null,null,null,null,null,null,"Export",null,null,{"$f":"SUMIF(U6:U61,\"<0\",U6:U61)","v":0},{"$f":"SUMIF(V6:V61,\"<0\",V6:V61)","v":0},{"$f":"SUMIF(W6:W61,\"<0\",W6:W61)","v":0},null,null,{"$f":"SUMIF(Z6:Z61,\"<0\",Z6:Z61)","v":0},{"$f":"SUMIF(AA6:AA61,\"<0\",AA6:AA61)","v":0}]
[null,null,null,null,null,null,null,null,null,null,null,null,null,null,null,null,null,null,null,null,{"$f":"K10","v":21},{"$f":"K11","v":310},{"$f":"K12","v":310},null,null,{"$f":"K13","v":310},{"$f":"K14","v":310}]
[null,null,null,null,null,null,null,null,null,null,null,null,null,null,null,null,null,"Export C02-e",null,null,{"$f":"U64*U63","v":0},{"$f":"V64*V63","v":0},0,null,null,0,0]

{"sheet":"MMS5","index":20,"n_rows":65,"n_cols":27,"rows_kept":65,"cut":false,"hidden":false,"merged":[[57,8,57,10],[46,5,46,6],[46,8,46,12],[48,8,48,10],[52,8,53,8],[55,5,55,6],[55,8,55,12],[50,5,50,6],[50,8,50,12],[35,8,35,12],[37,5,37,6],[37,8,37,12],[39,8,39,10],[43,8,44,8],[41,5,41,6],[41,8,41,12],[35,5,35,6],[26,8,27,12],[29,6,29,10],[31,5,31,6],[31,8,31,12],[33,8,33,10],[21,5,21,6],[21,8,21,12],[23,8,24,12],[3,5,4,12],[6,5,6,6],[6,8,6,12],[15,8,17,9],[19,5,19,6],[19,8,19,10]]}
["Hide"]
[null,null,null,null,null,null,null,null,null,null,null,null,null,null,null,null,null,null,null,null,"4B.8_1","4B.8_4","4B.1.a_10c",null,"4D3_6","4D3_6"]
[null,null,null,null,null,null,null,null,null,null,null,null,null,null,null,null,null,null,null,null,null,null,"4D3_4",null,null,"4D3_7"]
[null,null,null,null,null,"Manure Management System 1",null,null,null,null,null,null,null,null,null,null,null,null,null,null,"MMS-VS","MMS Direct","MMS -N Vol","Residual","LRO ","LRO","SOIL N20"]
[null,null,null,null,null,null,null,null,null,null,null,null,null,null,null,null,null,null,"MMS","MCF","CH4","N2O","N2O","N","N","N2O","N2O"]
[]
[null,null,null,null,null,"MMS5 Name",null,null,"Not Used"]
[]
[null,null,null,null,null,null,null,null,"Total",null,"x Factor",null,"CO2e"]
[null,null,null,null,null,null,"CH4",null,{"$f":"SUM(U22:U58)","v":0.22842972},null,{"$f":"CFCH4","v":21},null,{"$f":"K10*I10","v":4.7970241199999997}]
[null,null,null,null,null,null,"N2O Dir.",null,{"$f":"SUM(V22:V58)","v":2.7499999999999998E-3},null,{"$f":"CFN2O","v":310},null,{"$f":"K11*I11","v":0.85249999999999992}]
[null,null,null,null,null,null,"N2O Vol.",null,{"$f":"SUM(W22:W58)","v":6.2542857142857131E-3},null,{"$f":"CFN2O","v":310},null,{"$f":"K12*I12","v":1.9388285714285711}]
[null,null,null,null,null,null,"N2O LRO",null,{"$f":"SUM(Z22:Z58)","v":9.40543607142857E-4},null,{"$f":"CFN2O","v":310},null,{"$f":"K13*I13","v":0.29156851821428564}]
[null,null,null,null,null,null,"N20 Soil",null,{"$f":"SUM(AA22:AA58)","v":7.4869142857142855E-3},null,{"$f":"CFN2O","v":310},null,{"$f":"K14*I14","v":2.3209434285714283}]
[]
[null,null,null,null,null,null,null,null,"Exported Manure",null,"N2O",null,{"$f":"SUM(V65:AA65)","v":-0.77247798669642864}]
[]
[null,null,null,null,null,null,null,null,null,null,"CH4",null,{"$f":"U65","v":-2.8151550000000002E-3}]
[]
[null,null,null,null,null,"Production Type",null,null,"Indoor"]
[]
[{"$f":"IF(I20=\"Outdoor\",\"\",\"*\")","v":"*"},{"$f":"IF(A22=\"*\",0,1)","v":0},null,null,null,"Production System",null,null,"Dry Lot",null,null,null,null,null,null,null,{"$f":"INDEX(Assumption!$C$75:$G$75,S22)","v":"Daily Spread\n(%)"},{"$f":"IF($I$22=\"Free Range\",1,1-M30)","v":0.6},4,{"$f":"INDEX(TableG4MCF,MATCH(HomeState,States),'MMS5'!S22)*B22/100","v":0},{"$f":"EmmPot*'MMS5'!T22*DensCH4*R22","v":0},{"$f":"INDEX(Tale10,'MMS5'!S22)*44/28*B22*R22","v":0},{"$f":"INDEX(TableJ_1,S22)*AtmosDep*44/28*R22*B22","v":0},{"$f":"(1-INDEX(Tale10,'MMS5'!S22)-INDEX(TableJ_1,S22))*B22*R22","v":0},{"$f":"X22*VLOOKUP(HomeState,TableM2,3,FALSE)*FracLEACH","v":0},{"$f":"X22*VLOOKUP(HomeState,TableM2,3,FALSE)*FracLEACH*EFLRO*44/28","v":0},{"$f":"X22*0.01*44/28","v":0}]
[{"$f":"A22","v":"*"},{"$f":"B22","v":0},null,null,null,null,null,null,null,null,null,null,null,null,null,null,{"$f":"INDEX(Assumption!$C$75:$G$75,S23)","v":"Drylot\n(%)"},{"$f":"IF($I$22=\"Free Range\",0,M30)","v":0.4},3,{"$f":"INDEX(TableG4MCF,MATCH(HomeState,States),'MMS5'!S23)*B23/100","v":0},{"$f":"EmmPot*'MMS5'!T23*DensCH4*R23","v":0},{"$f":"INDEX(Tale10,'MMS5'!S23)*44/28*B23*R23","v":0},{"$f":"INDEX(TableJ_1,S23)*AtmosDep*44/28*R23*B23","v":0},{"$f":"(1-INDEX(Tale10,'MMS5'!S23)-INDEX(TableJ_1,S23))*B23*R23","v":0},{"$f":"X23*VLOOKUP(HomeState,TableM2,3,FALSE)*FracLEACH","v":0},{"$f":"X23*VLOOKUP(HomeState,TableM2,3,FALSE)*FracLEACH*EFLRO*44/28","v":0},{"$f":"X23*0.01*44/28","v":0}]
[{"$f":"A22","v":"*"},null,null,null,null,null,"Dry Lot",null,"Pigs in deep litter sheds which have access to outdoor runs"]
[{"$f":"A24","v":"*"}]
[{"$f":"A25","v":"*"}]
[{"$f":"A24","v":"*"},null,null,null,null,null,"Free Range",null,"Pigs which do not have deep litter sheds"]
[{"$f":"A27","v":"*"}]
[{"$f":"A28","v":"*"}]
[{"$f":"A32","v":"*"},null,null,null,null,null,"Manure Collected",null,null,null,null,null,0.4]
[{"$f":"A30","v":"*"}]
[{"$f":"IF(AND(I20=\"Outdoor\",I22=\"Dry Lot\"),\"\",\"*\")","v":"*"},null,null,null,null,"Solids Usage",null,null,"Export Off-Site",null,null,null,null,null,null,null,null,"Adjustment",null,null,null,null,null,{"$f":"IF($I$32=\"Export Off-Site\",X23*-1,0)*$M$34","v":0},{"$f":"IF($I$32=\"Export Off-Site\",Y23*-1,0)*$M$34","v":0},{"$f":"IF($I$32=\"Export Off-Site\",Z23*-1,0)*$M$34","v":0},{"$f":"IF($I$32=\"Export Off-Site\",AA23*-1,0)*$M$34","v":0}]
[{"$f":"A32","v":"*"}]
[{"$f":"IF(AND(I20=\"Outdoor\",I22=\"Dry Lot\",I32=\"Export Off-Site\"),\"\",\"*\")","v":"*"},{"$f":"IF(I32<>\"Export Off-Site\",\"*\",\"\")","v":""},null,null,null,null,null,null,"% Exported Off Site",null,null,null,0.8]
[{"$f":"A34","v":"*"}]
[{"$f":"IF(I20=\"Indoor\",\"\",\"*\")","v":""},{"$f":"IF(AND(I20=\"Indoor\",I36=\"Solid\"),1,0)","v":0},null,null,null,"Collection System",null,null,"Liquid",null,null,null,null,null,null,null,null,1,3,{"$f":"INDEX(TableG4MCF,MATCH(HomeState,States),'MMS5'!S36)*B36/100","v":0},{"$f":"EmmPot*'MMS5'!T36*DensCH4*R36","v":0},{"$f":"INDEX(Tale10,'MMS5'!S36)*44/28*B36*R36","v":0},{"$f":"INDEX(TableJ_1,S36)*AtmosDep*44/28*R36*B36","v":0},{"$f":"(1-INDEX(Tale10,'MMS5'!S36)-INDEX(TableJ_1,S36))*B36*R36","v":0},{"$f":"X36*VLOOKUP(HomeState,TableM2,3,FALSE)*FracLEACH","v":0},{"$f":"X36*VLOOKUP(HomeState,TableM2,3,FALSE)*FracLEACH*EFLRO*44/28","v":0},{"$f":"X36*0.01*44/28","v":0}]
[{"$f":"A36","v":""}]
[{"$f":"IF(AND(I20=\"Indoor\",I36=\"Solid\"),\"\",\"*\")","v":"*"},null,null,null,null,"Solids Usage",null,null,"Export Off-Site",null,null,null,null,null,null,null,null,{"$f":"R32","v":"Adjustment"},null,null,null,null,null,{"$f":"IF($I$38=\"Export Off-Site\",X36*-1,0)*$M$40","v":0},{"$f":"IF($I$38=\"Export Off-Site\",Y36*-1,0)*$M$40","v":0},{"$f":"IF($I$38=\"Export Off-Site\",Z36*-1,0)*$M$40","v":0},{"$f":"IF($I$38=\"Export Off-Site\",AA36*-1,0)*$M$40","v":0}]
[{"$f":"A38","v":"*"}]
[{"$f":"IF(AND(I36=\"Solid\",I38=\"Export Off-Site\"),\"\",\"*\")","v":"*"},null,null,null,null,null,null,null,"% Exported Off Site",null,null,null,0.5]
[{"$f":"A40","v":"*"}]
[{"$f":"IF(AND(I20=\"Indoor\",I36=\"Liquid\"),\"\",\"*\")","v":""},null,null,null,null,"Solid Extraction",null,null,"Run Down Screen"]
[{"$f":"A42","v":""}]
[{"$f":"A45","v":""},null,null,null,null,null,null,null,"Extracted",null,"VS",null,"N"]
[{"$f":"A46","v":""},{"$f":"IF(AND(I20=\"Indoor\",K45+M45<>0),1,0)","v":1},null,null,null,null,null,null,null,null,{"$f":"IF(I36=\"Liquid\",IF(ISERROR(VLOOKUP('MMS5'!$I$42,SolidExtVS_N,3,FALSE)),0,VLOOKUP('MMS5'!$I$42,SolidExtVS_N,3,FALSE)),0)","v":0.15},null,{"$f":"IF(I36=\"Liquid\",IF(ISERROR(VLOOKUP('MMS5'!$I$42,SolidExtVS_N,5,FALSE)),0,VLOOKUP('MMS5'!$I$42,SolidExtVS_N,5,FALSE)),0)","v":0.05},null,null,null,null,null,{"$f":"IF(I42=\"Effluent Daily Spread\",4,3)","v":3},{"$f":"INDEX(TableG4MCF,MATCH(HomeState,States),'MMS5'!S45)*B45/100","v":1.4999999999999999E-2},{"$f":"EmmPot*'MMS5'!T45*DensCH4*K45*B45","v":6.7027500000000002E-4},{"$f":"INDEX(Tale10,'MMS5'!S45)*44/28*B45*M45","v":1.5714285714285717E-3},{"$f":"INDEX(TableJ_1,S45)*AtmosDep*44/28*M45*B45","v":3.5357142857142857E-4},{"$f":"(1-INDEX(Tale10,'MMS5'!S45)-INDEX(TableJ_1,S45))*B45*M45","v":2.6500000000000003E-2},{"$f":"X45*VLOOKUP(HomeState,TableM2,3,FALSE)*FracLEACH","v":2.6632500000000003E-3},{"$f":"X45*VLOOKUP(HomeState,TableM2,3,FALSE)*FracLEACH*EFLRO*44/28","v":5.231383928571429E-5},{"$f":"X45*0.01*44/28","v":4.164285714285715E-4}]
[{"$f":"A47","v":""}]
[{"$f":"IF(AND(I20=\"Indoor\",K45+M45<>0),\"\",\"*\")","v":""},null,null,null,null,"Solids Usage",null,null,"Export Off-Site",null,null,null,null,null,null,null,null,{"$f":"R38","v":"Adjustment"},null,null,{"$f":"IF($I$47=\"Export Off-Site\",U45*-1,0)*$M$49","v":-1.34055E-4},-3.1428571428571437E-4,{"$f":"IF($I$47=\"Export Off-Site\",W45*-1,0)*$M$49","v":-7.0714285714285714E-5},{"$f":"IF(I47=\"Export Off-Site\",X45*-1,0)*M49","v":-5.3000000000000009E-3},{"$f":"IF($I$47=\"Export Off-Site\",Y45*-1,0)*$M$49","v":-5.3265000000000007E-4},{"$f":"IF($I$47=\"Export Off-Site\",Z45*-1,0)*$M$49","v":-1.0462767857142859E-5},{"$f":"IF($I$47=\"Export Off-Site\",AA45*-1,0)*$M$49","v":-8.3285714285714302E-5}]
[{"$f":"A47","v":""}]
[{"$f":"IF(AND(I20=\"Indoor\",K45+M45<>0,I47=\"Export Off-Site\"),\"\",\"*\")","v":""},null,null,null,null,null,null,null,"% Exported Off Site",null,null,null,0.2]
[{"$f":"A49","v":""}]
[{"$f":"IF(AND(I20=\"Indoor\",I36=\"Liquid\"),\"\",\"*\")","v":""},null,null,null,null,"Liquid Treatment",null,null,"Anaerobic Lagoon"]
[{"$f":"A51","v":""}]
[{"$f":"A52","v":""},null,null,null,null,null,null,null,"Balance",null,"VS",null,"N"]
[{"$f":"A53","v":""},{"$f":"IF(AND(I36=\"Liquid\",I20=\"Indoor\",K54+M54<>0),1,0)","v":1},null,null,null,null,null,null,"Balance",null,{"$f":"1-K45","v":0.85},null,{"$f":"1-M45","v":0.95},null,null,null,null,null,{"$f":"MATCH(I51,EffTreatment,0)","v":1},{"$f":"INDEX(TableG4MCF,MATCH(HomeState,States),'MMS5'!S54)*B54/100","v":0.9},{"$f":"EmmPot*'MMS5'!T54*DensCH4*K54","v":0.2278935},{"$f":"INDEX(Tale10,'MMS5'!S54)*44/28*B54*M54","v":1.4928571428571426E-3},{"$f":"INDEX(TableJ_1,S54)*AtmosDep*44/28*M54*B54","v":5.9714285714285702E-3},{"$f":"(1-INDEX(Tale10,'MMS5'!S54)-INDEX(TableJ_1,S54))*B54*M54","v":0.56904999999999994},{"$f":"X54*VLOOKUP(HomeState,TableM2,3,FALSE)*FracLEACH","v":5.7189524999999991E-2},{"$f":"X54*VLOOKUP(HomeState,TableM2,3,FALSE)*FracLEACH*EFLRO*44/28","v":1.1233656696428569E-3},{"$f":"X54*0.01*44/28","v":8.942214285714286E-3}]
[{"$f":"A54","v":""}]
[{"$f":"A55","v":""},null,null,null,null,"Treated Effluent Use",null,null,"Export Off-Site",null,null,null,null,null,null,null,null,{"$f":"R47","v":"Adjustment"},null,null,null,null,null,{"$f":"IF(I56=\"Export Off-Site\",X54*-1,0)*M58","v":-0.11380999999999999},{"$f":"IF(I56=\"Export Off-Site\",Y54*-1,0)*M58","v":-1.1437904999999998E-2},{"$f":"IF($I$56=\"Export Off-Site\",Z54*-1,0)*$M$58","v":-2.2467313392857138E-4},{"$f":"IF($I$56=\"Export Off-Site\",AA54*-1,0)*$M$58","v":-1.7884428571428572E-3}]
[{"$f":"A58","v":""}]
[{"$f":"IF(AND(I56=\"Export Off-Site\",I20=\"Indoor\",I36=\"Liquid\"),\"\",\"*\")","v":""},null,null,null,null,null,null,null,"% Exported Off Site",null,null,null,0.2]
[]
[]
[]
[]
[null,null,null,null,null,null,null,null,null,null,null,null,null,null,null,null,null,"Export",null,null,{"$f":"SUMIF(U6:U61,\"<0\",U6:U61)","v":-1.34055E-4},{"$f":"SUMIF(V6:V61,\"<0\",V6:V61)","v":-3.1428571428571437E-4},{"$f":"SUMIF(W6:W61,\"<0\",W6:W61)","v":-7.0714285714285714E-5},null,null,{"$f":"SUMIF(Z6:Z61,\"<0\",Z6:Z61)","v":-2.3513590178571425E-4},{"$f":"SUMIF(AA6:AA61,\"<0\",AA6:AA61)","v":-1.8717285714285716E-3}]
[null,null,null,null,null,null,null,null,null,null,null,null,null,null,null,null,null,null,null,null,{"$f":"K10","v":21},{"$f":"K11","v":310},{"$f":"K12","v":310},null,null,{"$f":"K13","v":310},{"$f":"K14","v":310}]
[null,null,null,null,null,null,null,null,null,null,null,null,null,null,null,null,null,"Export C02-e",null,null,{"$f":"U64*U63","v":-2.8151550000000002E-3},{"$f":"V64*V63","v":-9.7428571428571462E-2},-2.1921428571428571E-2,null,null,-7.2892129553571411E-2,-0.58023585714285719]

{"sheet":"FeedRaws","index":21,"n_rows":202,"n_cols":27,"rows_kept":202,"cut":false,"hidden":false,"merged":[[4,5,4,6],[2,5,2,19],[141,25,141,26],[3,15,3,18],[3,7,3,14],[141,5,141,18],[127,5,127,18],[121,5,121,18],[116,5,116,18],[110,5,110,18],[102,5,102,18],[97,5,97,18],[95,5,95,18],[90,5,90,18],[79,5,79,18],[76,5,76,18],[25,5,25,18],[23,5,23,18],[15,5,15,18],[5,5,5,18],[69,5,69,18],[57,5,57,18],[54,5,54,18],[40,5,40,18],[32,5,32,18]]}
[]
[]
[null,null,null,null,null,"Ingredient List"]
[null,null,null,null,null,null,null,"REQUIRED",null,null,null,null,null,null,null,"OPTIONAL"]
[null,"Code",null,null,null,"As-fed basis",null,"DM (%)","GE (MJ/kg)","DE (MJ/kg)","DMD %*","Crude Protein %","N (%)","Crude Fibre %","Ash (%)","Total Phos (%)","Phos availability (%)","Avail Phos (%)","K(%)","CO2 -e  (kg/kg CO2 -e)"]
[null,null,null,null,null,"Cereal Grains"]
[null,"Brl11",null,null,null,null,"Barley 11",88,16,12.8,{"$f":"J7/I7","v":0.8},11,{"$f":"L7/6.25","v":1.76},4.55,2.25,0.36,35,{"$f":"Q7/100*P7","v":0.126},0.47,0.37]
[null,"Grts",null,null,null,null,"Groats",90,16.059999999999999,15,0.93399750933997516,11,1.76,1.8,2.14,0.3,32,{"$f":"Q8/100*P8","v":9.6000000000000002E-2},0.35]
[null,"Mz8",null,null,null,null,"Maize 8",88,16.13,14.5,0.89894606323620585,8,1.28,2.15,1.21,0.25900000000000001,28,{"$f":"Q9/100*P9","v":7.2520000000000015E-2},0.33,0.15]
[null,"NkOat",null,null,null,null,"Naked oats",88,17.48,15.7,0.8981693363844393,10,1.6,2.5,1.8,0.46,34,0.15640000000000001,0.36]
[null,"Oats9",null,null,null,null,"Oats 9",88,17.149999999999999,12,0.69970845481049571,9,1.44,12.19,2.64,0.32,32,0.1024,0.36,0.37]
[null,"Sor11",null,null,null,null,"Sorghum 11",88,16.28,14.2,0.87223587223587218,11,1.76,2.2999999999999998,2,0.28000000000000003,20,5.6000000000000008E-2,0.35,0.31]
[null,"Trit11",null,null,null,null,"Triticale 11",88,15.75,14,0.88888888888888884,11,1.76,2.2999999999999998,1.92,0.35,40,0.13999999999999999,0.5,0.33]
[null,"Wht12",null,null,null,null,"Wheat 12",88,16.22,14.3,0.88162762022194829,12,1.92,2,1.7,0.34,50,0.17,0.41,0.36]
[null,"WhExt",null,null,null,null,"Wheat Extruded",88,16.22,15.2,0.93711467324290998,12,1.92,2,1.7,0.34,50,0.17,0.41]
[null,null,null,null,null,"Cereal by-products"]
[null,"Homny",null,null,null,null,"Hominy Meal",89,16.98,14.6,{"$f":"J17/I17","v":0.85983510011778563},13.4,{"$f":"L17/6.25","v":2.1440000000000001},5.52,4.6500000000000004,0.77,21,0.16170000000000001,0]
[null,"Mllrun",null,null,null,null,"Millrun",87,16.5,11.5,0.69696969696969702,15,2.4,9,5,0.95,29,0.27549999999999997,0.8]
[null,"RcHl",null,null,null,null,"Rice Hulls",89,16,2.5,0.15625,2,0.32,40,5,7.0000000000000007E-2,30,2.1000000000000001E-2,"¾"]
[null,"RcBrn",null,null,null,null,"Rice bran",90,16,7.7,0.48125000000000001,15.5,2.48,14,13,1.7,20,0.34,1.1499999999999999]
[null,"RcPld",null,null,null,null,"Rice Pollard",88,16.66,15.7,0.94237695078031203,15,2.4,9,1.41,1.2,33,0.39600000000000002,1.17]
[null,"WhtBrn",null,null,null,null,"Wheat Bran",87,16.440000000000001,9.4,0.57177615571776153,15,2.4,9.1999999999999993,5.05,0.99,30,0.29699999999999999,0.4]
[null,"WhtPld",null,null,null,null,"Wheat Pollard",87,16.53,11.2,0.67755595886267383,15,2.4,8.5,4.7,0.95,29,0.27549999999999997,1.2]
[null,null,null,null,null,"Roots & Tubers"]
[null,null,null,null,null,null,"Cassava",87,14.5,12.8,{"$f":"J25/I25","v":0.88275862068965527},3,{"$f":"L25/6.25","v":0.48},4.5,5.5,9.2999999999999999E-2,10,{"$f":"Q25/100*P25","v":9.300000000000001E-3},0.85]
[null,null,null,null,null,"By-products"]
[null,null,null,null,null,null,"Biscuit Meal",89,17,15.1,{"$f":"J27/I27","v":0.88823529411764701},10,{"$f":"L27/6.25","v":1.6},1,3,0.35,43,0.15049999999999999,0.39]
[null,null,null,null,null,null,"Brewers Grains",88,18.2,12,0.65934065934065933,22,{"$f":"L28/6.25","v":3.52},16,4.5,0.5,60,{"$f":"Q28/100*P28","v":0.3},0.3]
[null,null,null,null,null,null,"Distller's Dried Grains & Solubles (DDGS)",90,20.399999999999999,15.5,0.75980392156862753,26,{"$f":"L29/6.25","v":4.16},7.1,5,0.85,56,0.47600000000000003,1.23]
[null,null,null,null,null,null,"Molasses",74.5,11.02,10.3,0.93466424682395655,4.04,{"$f":"L30/6.25","v":0.64639999999999997},0,10.32,5.7000000000000002E-2,20,{"$f":"Q30/100*P30","v":1.14E-2},3.5]
[null,null,null,null,null,null,"Peanut shell",92,16,1.1000000000000001,6.8750000000000006E-2,3,{"$f":"L31/6.25","v":0.48},60,8,0.09,20,{"$f":"Q31/100*P31","v":1.7999999999999999E-2},1]
[null,null,null,null,null,null,"Sugar",99,20,15.1,0.755,0,0,0,0.5,0.04,100,{"$f":"Q32/100*P32","v":0.04},0,0.16]
[null,null,null,null,null,"Legumes"]
[null,null,null,null,null,null,"Faba beans",90,16.8,14.5,{"$f":"J34/I34","v":0.86309523809523803},23,{"$f":"L34/6.25","v":3.68},6.9,3.53,0.47,37,0.1739,0.96]
[null,null,null,null,null,null,"Lupins, albus",88,18.7,16,0.85561497326203206,34,5.44,10.6,3.3,0.36,50,0.18,1.1000000000000001]
[null,null,null,null,null,null,"Lupins, augustifolius",88,18.100000000000001,14.6,0.80662983425414359,30.5,4.88,13,2.8,0.3,50,0.15,0.85]
[null,null,null,null,null,null,"Chick Peas",90,17.53,15.1,0.86138049058756405,20,3.2,7,3,0.37,20,7.3999999999999996E-2,0.8]
[null,null,null,null,null,null,"Field Peas",86,16.8,14.5,0.86309523809523803,20.5,3.28,6.1,3,0.4,50,0.2,0.95,0.31]
[null,null,null,null,null,null,"Mung Beans",90,17,15.4,0.90588235294117647,24,3.84,3.9,3.7,0.7,33,0.23099999999999998,0.41]
[null,null,null,null,null,null,"Navy Beans",90,16.399999999999999,14.4,0.87804878048780499,24,3.84,6.97,3.8,0.43,33,0.1419,1.35]
[null,null,null,null,null,"Oilseed Meals"]
[null,null,null,null,null,null,"Canola Meal",91,17.68,12.4,{"$f":"J42/I42","v":0.70135746606334848},34,{"$f":"L42/6.25","v":5.44},12,6.5,1.1000000000000001,21,{"$f":"Q42/100*P42","v":0.23100000000000001},1.25,0.43]
[null,null,null,null,null,null,"Copra meal",90,18.190000000000001,13.1,{"$f":"J43/I43","v":0.72017592083562387},21,3.36,12.8,6.2,0.5,31,{"$f":"Q43/100*P43","v":0.155},"¾"]
[null,null,null,null,null,null,"Cotton seed meal 36",90,18.309999999999999,null,null,36,5.76,16.88,6.49,1.1359999999999999,26,{"$f":"Q44/100*P44","v":0.29536000000000001},1.25]
[null,null,null,null,null,null,"Cotton seed meal 43",90,18.72,13,{"$f":"J45/I45","v":0.69444444444444453},43,6.88,16.8,6.5,1.1399999999999999,26,{"$f":"Q45/100*P45","v":0.2964},1.25]
[null,null,null,null,null,null,"Palm Kernel meal",90,18.21,12.5,0.68643602416254801,14.75,2.36,17.899999999999999,4.2,0.56000000000000005,31,{"$f":"Q46/100*P46","v":0.1736},0.65]
[null,null,null,null,null,null,"Peanut Meal 48",90,18.2,14.6,0.80219780219780223,48,7.68,5.6,5,0.6,30,0.18,null,0.27]
[null,null,null,null,null,null,"Soybean Meal 45",88,17.079999999999998,14.9,0.87236533957845441,45,7.2,6.11,6.48,0.624,20,0.12480000000000001,1.9,0.27]
[null,null,null,null,null,null,"Soybean Meal 48",88.5,17.41,14.9,0.85582998276852384,48,7.68,3.7,6.5,0.65,31,0.20150000000000001,2.1,0.73]
[null,null,null,null,null,null,"Soybean, Full fat",87.5,20.5,17.5,0.85365853658536583,35.5,5.68,5.8,5.3,0.55000000000000004,31,0.17050000000000001,1.7]
[null,null,null,null,null,null,"Soya protein (HP 300)",92,18.850000000000001,15.5,0.82228116710875321,56,8.9600000000000009,3.5,6.8,0.8,30,0.24,2.2999999999999998]
[null,null,null,null,null,null,"Soycomil R",95,18.920000000000002,17.600000000000001,0.93023255813953487,65,10.4,3.5,6.5,0.8,30,0.24,2.2000000000000002]
[null,null,null,null,null,null,"Sunflower 30",89,17.22,8.3000000000000007,0.48199767711962843,30,4.8,24,6.3,1,19,0.19,1.46]
[null,null,null,null,null,null,"Sunflower 36",89,17.23,13.1,0.76030179918746366,36,5.76,18,7,1.2,19,0.22799999999999998,1.52]
[null,null,null,null,null,"Yeast Products"]
[null,null,null,null,null,null,"Brewers Yeast",90,18.64,16,{"$f":"J56/I56","v":0.85836909871244638},50,{"$f":"L56/6.25","v":8},1.9,7.1,1.1599999999999999,20,{"$f":"Q56/100*P56","v":0.23199999999999998},1.7]
[null,null,null,null,null,null,"Nupro",94,18.600000000000001,14.2,{"$f":"J57/I57","v":0.76344086021505364},47,{"$f":"L57/6.25","v":7.52},1,8.3000000000000007,1.5,90,1.35,1.9]
[null,null,null,null,null,"Animal & Fish products"]
[null,null,null,null,null,null,"Blood meal, spray/ring",91,22.89,18.309999999999999,{"$f":"J59/I59","v":0.79991262560069887},85,{"$f":"L59/6.25","v":13.6},{"$f":"M59/6.25","v":2.1760000000000002},2.83,0.21,90,0.189,0.26]
[null,null,null,null,null,null,"Blood Plasma",92,20.99,17.2,0.8194378275369224,78,{"$f":"L60/6.25","v":12.48},0.3,10,1.3,95,1.2349999999999999,0.3]
[null,null,null,null,null,null,"Fishmeal 62",92,18.32,14.8,0.80786026200873362,62,9.92,0,20.75,2.85,90,2.5649999999999999,0.3]
[null,null,null,null,null,null,"Fishmeal 65",92,18.98,15.7,0.82718651211801886,65,10.4,0,16.14,2.6,90,2.3400000000000003,1.3]
[null,null,null,null,null,null,"Feather meal",92,21.76,16.32,0.75,80,12.8,0,5.34,0.79600000000000004,20,0.15920000000000001,0.1]
[null,null,null,null,null,null,"Meat & bone meal",93,16.57,12,0.72420036210018102,50,8,2,30,4.9000000000000004,75,3.6750000000000003,0.5,0.5]
[null,null,null,null,null,null,"Milk, full cream powder",97,22.66,21.75,0.95984112974404234,26,4.16,0,6,0.8,90,0.72000000000000008]
[null,null,null,null,null,null,"Milk, chocolate milk powder",97,17.350000000000001,16.399999999999999,0.94524495677233411,17,2.72,0,6,1,90,0.9]
[null,null,null,null,null,null,"Milk, skim milk powder",95,17.350000000000001,16.399999999999999,0.94524495677233411,35.5,5.68,0,8,1,90,0.9,1.6]
[null,null,null,null,null,null,"Milk, whole milk powder",95,22.66,21.75,0.95984112974404234,25,4,0,6,0.8,90,0.72000000000000008,1.3]
[null,null,null,null,null,null,"Milk, whey powder",95,16,14,0.875,12.5,2,0,8.6999999999999993,0.9,90,0.81,5]
[null,null,null,null,null,"Hay & Straw"]
[null,null,null,null,null,null,"Barley straw",89,16,1,{"$f":"J71/I71","v":6.25E-2},3.79,{"$f":"L71/6.25","v":0.60640000000000005},38.9,5.28,0.2,20,{"$f":"Q71/100*P71","v":4.0000000000000008E-2},1.17]
[null,null,null,null,null,null,"Cereal straw pellets",88,16.010000000000002,2,{"$f":"J72/I72","v":0.12492192379762647},3.5,{"$f":"L72/6.25","v":0.56000000000000005},38,6,0.08,20,1.6E-2,0.8]
[null,null,null,null,null,null,"Lucerne meal/crumbles",90,16.27,7.25,{"$f":"J73/I73","v":0.44560540872771975},16.5,{"$f":"L73/6.25","v":2.64},26,10,0.23,20,4.6000000000000006E-2,1.9]
[null,null,null,null,null,null,"Lucerne hay"]
[null,null,null,null,null,null,"Oat straw",87,16,1,{"$f":"J75/I75","v":6.25E-2},5.2,{"$f":"L75/6.25","v":0.83200000000000007},33.9,8.8000000000000007,0.22,20,{"$f":"Q75/100*P75","v":4.4000000000000004E-2},2.27]
[null,null,null,null,null,null,"Wheat straw",90,16.899999999999999,2.5,{"$f":"J76/I76","v":0.14792899408284024},3.84,{"$f":"L76/6.25","v":0.61439999999999995},38.17,5.85,6.7000000000000004E-2,20,1.3400000000000002E-2,1.33]
[null,null,null,null,null,"Fats"]
[null,null,null,null,null,null,"Tallow",99,39.29,36,{"$f":"J78/I78","v":0.91626368032578265},0.5,{"$f":"L78/6.25","v":0.08},0,0,0,0,0,0]
[null,null,null,null,null,null,"Vegetable oil",99.5,38.39,36.200000000000003,{"$f":"J79/I79","v":0.94295389424329257},0,{"$f":"L79/6.25","v":0},0,0,0,0,0,0]
[null,null,null,null,null,"Minerals"]
[null,null,null,null,null,null,"Choline Chloride",95,0,0,0,0,{"$f":"L81/6.25","v":0},0,5,0,0,{"$f":"Q81/100*P81","v":0},0]
[null,null,null,null,null,null,"Copper Sulphate",98.5,0,0,0,0,0,0,100,0,0,{"$f":"Q82/100*P82","v":0},0]
[null,null,null,null,null,null,"Dicalphos",100,0,0,0,0,0,0,78,18.2,100,18.2,0]
[null,null,null,null,null,null,"Ferrous Sulphate",98.5,0,0,0,0,0,0,99,0,0,0,0]
[null,null,null,null,null,null,"Kynofos",98,0,0,0,0,0,0,100,21,100,{"$f":"Q85/100*P85","v":21},0]
[null,null,null,null,null,null,"Limestone",99,0,0,0,0,0,0,99,0,0,0,0]
[null,null,null,null,null,null,"Potassium Choride",100,0,0,0,0,0,0,100,0,0,{"$f":"Q87/100*P87","v":0},52.1]
[null,null,null,null,null,null,"Potassium sulphate",100,0,0,0,0,{"$f":"L88/6.25","v":0},0,100,0,0,0,17.55]
[null,null,null,null,null,null,"Salt",100,0,0,0,0,{"$f":"L89/6.25","v":0},0,100,0,0,0,0]
[null,null,null,null,null,null,"Zinc Oxide",100,0,0,0,0,{"$f":"L90/6.25","v":0},0,98,0,0,{"$f":"Q90/100*P90","v":0},0]
[null,null,null,null,null,"Synthetic amino acids"]
[null,null,null,null,null,null,"L-Lysine HCL",99.5,20.010000000000002,20.010000000000002,{"$f":"J92/I92","v":1},95.4,{"$f":"L92/6.25","v":15.264000000000001},0,0.5,0,0,0,0,3.6]
[null,null,null,null,null,null,"DL-Methionie",99.5,23.6,23.6,{"$f":"J93/I93","v":1},58.4,{"$f":"L93/6.25","v":9.3439999999999994},0,0.2,0,0,0,0,3.6]
[null,null,null,null,null,null,"L-Threonine",99.5,17.239999999999998,17.239999999999998,{"$f":"J94/I94","v":1},73.13,{"$f":"L94/6.25","v":11.700799999999999},0,0.5,0,0,0,0,3.6]
[null,null,null,null,null,null,"L-Tryptophan",99.5,27.48,27.48,{"$f":"J95/I95","v":1},85.26,{"$f":"L95/6.25","v":13.6416},0,0.5,0,0,0,0,3.6]
[null,null,null,null,null,"Micellaneous ingredients"]
[null,null,null,null,null,null,"Bentonite",99,0,0,0,0,0,0,99,0,0,0,0]
[null,null,null,null,null,"Vitamin/mineral premixes"]
[null,null,null,null,null,null,"Breeder premix",100,0,0,0,0,0,0,23,0,0,0]
[null,null,null,null,null,null,"Grower premix",100,0,0,0,0,{"$f":"L100/6.25","v":0},0,23,0,0,0]
[null,null,null,null,null,null,"Weaner premix",100,0,0,0,0,{"$f":"L101/6.25","v":0},0,23,0,0,0]
[null,null,null,null,null,null,"Bioplex Sow Pak",100,0,0,0,0,{"$f":"L102/6.25","v":0},0,23,0,0,0]
[null,null,null,null,null,"Enzymes"]
[null,null,null,null,null,null,"FEEDZYME (1 kg dose)",100,null,null,null,3000,{"$f":"L104/6.25","v":480},0,null,null,120,null,0]
[null,null,null,null,null,null,"Kemzyme",100,null,null,null,null,0,0,null,null,null,0,0]
[null,null,null,null,null,null,"Phyzyme (500 FTU OR 100g dose)",100,null,null,null,6250,1000,0,null,1200,100,1200,0]
[null,null,null,null,null,null,"Phyzyme (1000 FTU OR 200g dose)",100,null,null,null,3175,508,0,null,900,100,900,0]
[null,null,null,null,null,null,"Ronozyme P 5000 (150g dose)",100,null,null,null,1682,269.12,0,null,704,75,{"$f":"Q108/100*P108","v":528},0]
[null,null,null,null,null,null,"Rovabio Excel premix",100,null,null,null,null,0,0,null,null,null,null,0]
[null,null,null,null,null,null,"Allzyme SSF",100,1260,1260,{"$f":"J110/I110","v":1},1000,{"$f":"L110/6.25","v":160},0,null,null,null,500,0]
[null,null,null,null,null,"Toxin Binders"]
[null,null,null,null,null,null,"Biofix",100,0,0,0,0,0,0,null,0,0,0,0]
[null,null,null,null,null,null,"Mycofix",100,0,0,0,0,0,0,null,0,0,0,0]
[null,null,null,null,null,null,"Mycosorb",100,0,0,0,0,0,0,null,0,0,0,0]
[null,null,null,null,null,null,"Elitox",100,0,0,0,0,0,0,null,0,0,0,0]
[null,null,null,null,null,null,"Kembind",100,0,0,0,0,0,0,null,0,0,0,0]
[null,null,null,null,null,"Acidifiers"]
[null,null,null,null,null,null,"Biotronic SE (Biomin)",100,0,0,0,0,0,0,null,0,0,0,0]
[null,null,null,null,null,null,"Tetracid 500",100,0,0,0,0,0,0,null,0,0,0,0]
[null,null,null,null,null,null,"AcidLac",100,0,0,0,0,0,0,null,0,0,0,0]
[null,null,null,null,null,null,"Acid-Pak 4Way",100,0,0,0,0,0,0,null,0,0,0,0]
[null,null,null,null,null,"Other Additives"]
[null,null,null,null,null,null,"Biomin® pHD"]
[null,null,null,null,null,null,"Betaine (Betafin)",100,200,200,1,0,0,0,null,0,0,0,0]
[null,null,null,null,null,null,"Biomos",100,0,0,0,0,{"$f":"L125/6.25","v":0},0,98,0,0,{"$f":"Q125/100*P125","v":0}]
[null,null,null,null,null,null,"De-Oderase",99,0,0,0,0,{"$f":"L126/6.25","v":0},0,98,0,0,{"$f":"Q126/100*P126","v":0}]
[null,null,null,null,null,null,"Paylean",100,0,0,0,0,0,0,98,0,0,0,0]
[null,null,null,null,null,"Additional Raw Materials"]
[null,null,null,null,null,null,null,null,null,null,null,null,{"$f":"IF(L129<>0,L129/6.25,\"\")","v":""}]
[null,null,null,null,null,null,null,null,null,null,null,null,{"$f":"IF(L130<>0,L130/6.25,\"\")","v":""}]
[null,null,null,null,null,null,null,null,null,null,null,null,""]
[null,null,null,null,null,null,null,null,null,null,null,null,""]
[null,null,null,null,null,null,null,null,null,null,null,null,""]
[null,null,null,null,null,null,null,null,null,null,null,null,""]
[null,null,null,null,null,null,null,null,null,null,null,null,""]
[null,null,null,null,null,null,null,null,null,null,null,null,""]
[null,null,null,null,null,null,null,null,null,null,null,null,""]
[null,null,null,null,null,null,null,null,null,null,null,null,""]
[null,null,null,null,null,null,null,null,null,null,null,null,""]
[null,null,null,null,null,null,null,null,null,null,null,null,""]
[null,null,null,null,null,null,null,null,null,null,null,null,""]
[null,null,null,null,null,"Complete Diets",null,null,null,null,null,null,null,null,null,null,null,null,null,null,null,null,null,null,null,"Regression"]
[null,null,null,null,null,null,null,null,{"$f":"IF(K143<>0,J143/K143,\"\")","v":""},null,{"$f":"IF(N143<>0,$AA$143+$AA$144*N143+$AA$145*O143,0)","v":0},null,{"$f":"IF(L143<>0,L143/6.25,\"\")","v":""},null,null,null,null,null,null,null,null,null,null,null,null,"Intercept",0.98506159491095202]
[null,null,null,null,null,null,null,null,{"$f":"IF(K144<>0,J144/K144,\"\")","v":""},null,0,null,{"$f":"IF(L144<>0,L144/6.25,\"\")","v":""},null,null,null,null,null,null,null,null,null,null,null,null,"Fibre",-1.9966451115706649E-2]
[null,null,null,null,null,null,null,null,{"$f":"IF(K145<>0,J145/K145,\"\")","v":""},null,0,null,{"$f":"IF(L145<>0,L145/6.25,\"\")","v":""},null,null,null,null,null,null,null,null,null,null,null,null,"Ash",-9.1868691080769921E-3]
[null,null,null,null,null,null,null,null,{"$f":"IF(K146<>0,J146/K146,\"\")","v":""},null,0,null,{"$f":"IF(L146<>0,L146/6.25,\"\")","v":""}]
[null,null,null,null,null,null,null,null,{"$f":"IF(K147<>0,J147/K147,\"\")","v":""},null,0,null,{"$f":"IF(L147<>0,L147/6.25,\"\")","v":""}]
[null,null,null,null,null,null,null,null,"",null,0,null,""]
[null,null,null,null,null,null,null,null,"",null,0,null,""]
[null,null,null,null,null,null,null,null,"",null,0,null,""]
[null,null,null,null,null,null,null,null,"",null,0,null,""]
[null,null,null,null,null,null,null,null,"",null,0,null,""]
[null,null,null,null,null,null,null,null,"",null,0,null,""]
[null,null,null,null,null,null,null,null,"",null,0,null,""]
[null,null,null,null,null,null,null,null,"",null,0,null,""]
[null,null,null,null,null,null,null,null,"",null,0,null,""]
[null,null,null,null,null,null,null,null,"",null,0,null,""]
[null,null,null,null,null,null,null,null,"",null,0,null,""]
[null,null,null,null,null,null,null,null,"",null,0,null,""]
[null,null,null,null,null,null,null,null,"",null,0,null,""]
[null,null,null,null,null,null,null,null,"",null,0,null,""]
[null,null,null,null,null,null,null,null,"",null,0,null,""]
[null,null,null,null,null,null,null,null,"",null,0,null,""]
[null,null,null,null,null,null,null,null,"",null,0,null,""]
[null,null,null,null,null,null,null,null,"",null,0,null,""]
[null,null,null,null,null,null,null,null,"",null,0,null,""]
[null,null,null,null,null,null,null,null,{"$f":"IF(K167<>0,J167/K167,\"\")","v":""},null,0,null,{"$f":"IF(L167<>0,L167/6.25,\"\")","v":""}]
[null,null,null,null,null,null,null,null,"",null,0,null,""]
[null,null,null,null,null,null,null,null,"",null,0,null,""]
[null,null,null,null,null,null,null,null,"",null,0,null,""]
[null,null,null,null,null,null,null,null,"",null,0,null,""]
[null,null,null,null,null,null,null,null,"",null,0,null,""]
[null,null,null,null,null,null,null,null,"",null,0,null,""]
[null,null,null,null,null,null,null,null,"",null,0,null,""]
[null,null,null,null,null,null,null,null,"",null,{"$f":"IF(N175<>0,$AA$143+$AA$144*N175+$AA$145*O175,0)","v":0},null,""]
[null,null,null,null,null,null,null,null,"",null,0,null,""]
[null,null,null,null,null,null,null,null,"",null,0,null,""]
[null,null,null,null,null,null,null,null,"",null,0,null,""]
[null,null,null,null,null,null,null,null,"",null,0,null,""]
[null,null,null,null,null,null,null,null,"",null,0,null,""]
[null,null,null,null,null,null,null,null,"",null,0,null,""]
[null,null,null,null,null,null,null,null,"",null,0,null,""]
[null,null,null,null,null,null,null,null,"",null,0,null,""]
[null,null,null,null,null,null,null,null,"",null,0,null,""]
[null,null,null,null,null,null,null,null,"",null,0,null,""]
[null,null,null,null,null,null,null,null,"",null,0,null,""]
[null,null,null,null,null,null,null,null,"",null,0,null,""]
[null,null,null,null,null,null,null,null,"",null,0,null,""]
[null,null,null,null,null,null,null,null,"",null,0,null,""]
[null,null,null,null,null,null,null,null,"",null,0,null,""]
[null,null,null,null,null,null,null,null,"",null,0,null,""]
[null,null,null,null,null,null,null,null,"",null,0,null,""]
[null,null,null,null,null,null,null,null,"",null,0,null,""]
[null,null,null,null,null,null,null,null,"",null,0,null,""]
[null,null,null,null,null,null,null,null,"",null,0,null,""]
[null,null,null,null,null,null,null,null,"",null,0,null,""]
[null,null,null,null,null,null,null,null,"",null,0,null,""]
[null,null,null,null,null,null,null,null,"",null,0,null,""]
[null,null,null,null,null,null,null,null,"",null,0,null,""]
[null,null,null,null,null,null,null,null,"",null,0,null,""]
[null,null,null,null,null,null,null,null,"",null,0,null,""]
[null,null,null,null,null,null,null,null,"",null,0,null,""]

{"sheet":"Feeds","index":22,"n_rows":234,"n_cols":45,"rows_kept":234,"cut":false,"hidden":false,"merged":[[77,3,82,3],[65,3,75,3],[11,3,11,4],[11,5,11,8],[110,3,116,3],[105,3,108,3],[98,3,101,3],[87,3,96,3],[84,3,85,3],[149,3,208,3],[135,3,147,3],[129,3,133,3],[124,3,127,3],[118,3,122,3],[6,5,6,8],[6,9,6,12],[6,13,6,16],[6,17,6,20],[11,25,11,28],[7,5,7,8],[7,9,7,12],[7,13,7,16],[7,17,7,20],[7,21,7,24],[11,9,11,12],[11,13,11,16],[6,25,6,28],[6,29,6,32],[6,33,6,36],[11,17,11,20],[11,21,11,24],[6,21,6,24],[11,29,11,32],[6,37,6,40],[6,41,6,44],[62,3,63,3],[48,3,60,3],[40,3,46,3],[33,3,38,3],[7,41,7,44],[7,25,7,28],[7,29,7,32],[7,33,7,36],[7,37,7,40],[23,3,29,3],[13,3,21,3],[11,33,11,36],[11,37,11,40],[11,41,11,44]]}
[]
[]
[]
[null,null,null,null,"Mix Total (100 for %)",100]
[]
[]
[null,null,null,null,null,1,null,null,null,2,null,null,null,3,null,null,null,4,null,null,null,5,null,null,null,6,null,null,null,7,null,null,null,8,null,null,null,9,null,null,null,10]
[null,null,null,null,null,{"$f":"INDEX(Feeds,F7)","v":"Sucker"},null,null,null,{"$f":"INDEX(Feeds,J7)","v":"Weaner"},null,null,null,{"$f":"INDEX(Feeds,N7)","v":"Grower"},null,null,null,{"$f":"INDEX(Feeds,R7)","v":"Finisher"},null,null,null,{"$f":"INDEX(Feeds,V7)","v":"LacSow"},null,null,null,{"$f":"INDEX(Feeds,Z7)","v":"DrySow"},null,null,null,{"$f":"INDEX(Feeds,AD7)","v":0},null,null,null,{"$f":"INDEX(Feeds,AH7)","v":0},null,null,null,{"$f":"INDEX(Feeds,AL7)","v":0},null,null,null,{"$f":"INDEX(Feeds,AP7)","v":0}]
[null,null,null,null,null,"Diet 1","Diet 2","Diet 3","Diet 4",{"$f":"F9","v":"Diet 1"},{"$f":"G9","v":"Diet 2"},"Diet 3","Diet 4","Diet 1","Diet 2","Diet 3","Diet 4","Diet 1","Diet 2","Diet 3","Diet 4","Diet 1","Diet 2","Diet 3","Diet 4","Diet 1","Diet 2","Diet 3","Diet 4","Diet 1","Diet 2","Diet 3","Diet 4","Diet 1","Diet 2","Diet 3","Diet 4","Diet 1","Diet 2","Diet 3","Diet 4","Diet 1","Diet 2","Diet 3","Diet 4"]
[null,null,null,null,"Balance >",{"$f":"IF(SUM(F13:F209)<>0,$F$4-SUM(F13:F209),0)","v":0},{"$f":"IF(SUM(G13:G209)<>0,$F$4-SUM(G13:G209),0)","v":0},{"$f":"IF(SUM(H13:H209)<>0,$F$4-SUM(H13:H209),0)","v":0},0,0,0,0,0,-1.4210854715202004E-14,0,0,0,0,0,0,0,1.4210854715202004E-14,1.4210854715202004E-14,0,0,1.4210854715202004E-14,0,0,0,0,0,0,0,0,0,0,0,0,0,0,0,0,0,0,0]
[null,null,null,null,"% of Diet Consumed",null,null,null,{"$f":"1-(SUM(F11:H11))","v":1},null,null,null,{"$f":"1-(SUM(J11:L11))","v":1},0.5,0.5,null,{"$f":"1-(SUM(N11:P11))","v":0},0.5,0.5,null,{"$f":"1-(SUM(R11:T11))","v":0},0.5,0.5," ",{"$f":"1-(SUM(V11:X11))","v":0},0.5,0.5," ",{"$f":"1-(SUM(Z11:AB11))","v":0},null,null,null,{"$f":"1-(SUM(AD11:AF11))","v":1},null,null,null,{"$f":"1-(SUM(AH11:AJ11))","v":1},null,null,null,{"$f":"1-(SUM(AL11:AN11))","v":1},null,null,null,{"$f":"1-(SUM(AP11:AR11))","v":1}]
[null,null,null,"As-fed basis",null,"As-fed basis",null,null,null,"As-fed basis",null,null,null,"As-fed basis",null,null,null,"As-fed basis",null,null,null,"As-fed basis",null,null,null,"As-fed basis",null,null,null,"As-fed basis",null,null,null,"As-fed basis",null,null,null,"As-fed basis",null,null,null,"As-fed basis"]
[null,null,null,{"$f":"FeedRaws!F6","v":"Cereal Grains"}]
[null,null,null,null,{"$f":"FeedRaws!G7","v":"Barley 11"},null,null,null,null,null,null,null,null,null,null,null,null,37,null,null,null,35.76,45.17,null,null,74.819999999999993,74.63]
[null,null,null,null,{"$f":"FeedRaws!G8","v":"Groats"}]
[null,null,null,null,{"$f":"FeedRaws!G9","v":"Maize 8"}]
[null,null,null,null,{"$f":"FeedRaws!G10","v":"Naked oats"}]
[null,null,null,null,{"$f":"FeedRaws!G11","v":"Oats 9"}]
[null,null,null,null,{"$f":"FeedRaws!G12","v":"Sorghum 11"},null,null,null,null,null,null,null,null,null,78.930000000000007,null,null,null,79.7,null,null,null,34,null,null,null,14.5]
[null,null,null,null,{"$f":"FeedRaws!G13","v":"Triticale 11"}]
[null,null,null,null,{"$f":"FeedRaws!G14","v":"Wheat 12"},null,null,null,46.75,null,null,null,76.67,79.790000000000006,null,null,null,44.03,null,null,null,46,null,null,null,15]
[null,null,null,null,{"$f":"FeedRaws!G15","v":"Wheat Extruded"},null,null,null,25]
[null,null,null,{"$f":"FeedRaws!F16","v":"Cereal by-products"}]
[null,null,null,null,{"$f":"FeedRaws!G17","v":"Hominy Meal"}]
[null,null,null,null,{"$f":"FeedRaws!G18","v":"Millrun"}]
[null,null,null,null,{"$f":"FeedRaws!G19","v":"Rice Hulls"}]
[null,null,null,null,{"$f":"FeedRaws!G20","v":"Rice bran"}]
[null,null,null,null,{"$f":"FeedRaws!G21","v":"Rice Pollard"}]
[null,null,null,null,{"$f":"FeedRaws!G22","v":"Wheat Bran"}]
[null,null,null,null,{"$f":"FeedRaws!G23","v":"Wheat Pollard"}]
[null,null,null,{"$f":"FeedRaws!F24","v":"Roots & Tubers"}]
[null,null,null,{"$f":"FeedRaws!F25","v":0},{"$f":"FeedRaws!G25","v":"Cassava"}]
[null,null,null,{"$f":"FeedRaws!F26","v":"By-products"}]
[null,null,null,null,{"$f":"FeedRaws!G27","v":"Biscuit Meal"}]
[null,null,null,null,{"$f":"FeedRaws!G28","v":"Brewers Grains"}]
[null,null,null,null,{"$f":"FeedRaws!G29","v":"Distller's Dried Grains & Solubles (DDGS)"}]
[null,null,null,null,{"$f":"FeedRaws!G30","v":"Molasses"}]
[null,null,null,null,{"$f":"FeedRaws!G31","v":"Peanut shell"}]
[null,null,null,null,{"$f":"FeedRaws!G32","v":"Sugar"}]
[null,null,null,{"$f":"FeedRaws!F33","v":"Legumes"}]
[null,null,null,null,{"$f":"FeedRaws!G34","v":"Faba beans"}]
[null,null,null,null,{"$f":"FeedRaws!G35","v":"Lupins, albus"}]
[null,null,null,null,{"$f":"FeedRaws!G36","v":"Lupins, augustifolius"}]
[null,null,null,null,{"$f":"FeedRaws!G37","v":"Chick Peas"}]
[null,null,null,null,{"$f":"FeedRaws!G38","v":"Field Peas"}]
[null,null,null,null,{"$f":"FeedRaws!G39","v":"Mung Beans"}]
[null,null,null,null,{"$f":"FeedRaws!G40","v":"Navy Beans"}]
[null,null,null,{"$f":"FeedRaws!F41","v":"Oilseed Meals"}]
[null,null,null,null,{"$f":"FeedRaws!G42","v":"Canola Meal"}]
[null,null,null,null,{"$f":"FeedRaws!G43","v":"Copra meal"}]
[null,null,null,null,{"$f":"FeedRaws!G44","v":"Cotton seed meal 36"}]
[null,null,null,null,{"$f":"FeedRaws!G45","v":"Cotton seed meal 43"}]
[null,null,null,null,{"$f":"FeedRaws!G46","v":"Palm Kernel meal"}]
[null,null,null,null,{"$f":"FeedRaws!G47","v":"Peanut Meal 48"}]
[null,null,null,null,{"$f":"FeedRaws!G48","v":"Soybean Meal 45"},null,null,null,null,null,null,null,6.5,12,12,null,null,12,12,null,null,8.5,10,null,null,3.5,4.5]
[null,null,null,null,{"$f":"FeedRaws!G49","v":"Soybean Meal 48"}]
[null,null,null,null,{"$f":"FeedRaws!G50","v":"Soybean, Full fat"},null,null,null,4,null,null,null,5]
[null,null,null,null,{"$f":"FeedRaws!G51","v":"Soya protein (HP 300)"}]
[null,null,null,null,{"$f":"FeedRaws!G52","v":"Soycomil R"}]
[null,null,null,null,{"$f":"FeedRaws!G53","v":"Sunflower 30"}]
[null,null,null,null,{"$f":"FeedRaws!G54","v":"Sunflower 36"}]
[null,null,null,{"$f":"FeedRaws!F55","v":"Yeast Products"}]
[null,null,null,null,{"$f":"FeedRaws!G56","v":"Brewers Yeast"}]
[null,null,null,null,{"$f":"FeedRaws!G57","v":"Nupro"}]
[null,null,null,{"$f":"FeedRaws!F58","v":"Animal & Fish products"}]
[null,null,null,null,{"$f":"FeedRaws!G59","v":"Blood meal, spray/ring"},null,null,null,null,null,null,null,null,1.31,2.5,null,null,null,2,null,null,null,0.5]
[null,null,null,null,{"$f":"FeedRaws!G60","v":"Blood Plasma"}]
[null,null,null,null,{"$f":"FeedRaws!G61","v":"Fishmeal 62"}]
[null,null,null,null,{"$f":"FeedRaws!G62","v":"Fishmeal 65"},null,null,null,12,null,null,null,5,null,null,null,null,null,null,null,null,2.5,2.5]
[null,null,null,null,{"$f":"FeedRaws!G63","v":"Feather meal"}]
[null,null,null,null,{"$f":"FeedRaws!G64","v":"Meat & bone meal"},null,null,null,4,null,null,null,5,6.36,5,null,null,6.5,5,null,null,4.5,4,null,null,6,5.5]
[null,null,null,null,{"$f":"FeedRaws!G65","v":"Milk, full cream powder"}]
[null,null,null,null,{"$f":"FeedRaws!G66","v":"Milk, chocolate milk powder"}]
[null,null,null,null,{"$f":"FeedRaws!G67","v":"Milk, skim milk powder"},null,null,null,7.5]
[null,null,null,null,{"$f":"FeedRaws!G68","v":"Milk, whole milk powder"}]
[null,null,null,null,{"$f":"FeedRaws!G69","v":"Milk, whey powder"}]
[null,null,null,{"$f":"FeedRaws!F70","v":"Hay & Straw"}]
[null,null,null,null,{"$f":"FeedRaws!G71","v":"Barley straw"}]
[null,null,null,null,{"$f":"FeedRaws!G72","v":"Cereal straw pellets"}]
[null,null,null,null,{"$f":"FeedRaws!G73","v":"Lucerne meal/crumbles"}]
[null,null,null,null,{"$f":"FeedRaws!G74","v":"Lucerne hay"}]
[null,null,null,null,{"$f":"FeedRaws!G75","v":"Oat straw"}]
[null,null,null,null,{"$f":"FeedRaws!G76","v":"Wheat straw"}]
[null,null,null,{"$f":"FeedRaws!F77","v":"Fats"}]
[null,null,null,null,{"$f":"IF(FeedRaws!G78<>\"\",FeedRaws!G78,\"\")","v":"Tallow"},null,null,null,null,null,null,null,1.39,0.15,0.15,null,null,null,null,null,null,2.42,3.07]
[null,null,null,null,{"$f":"IF(FeedRaws!G79<>\"\",FeedRaws!G79,\"\")","v":"Vegetable oil"},null,null,null,0.3]
[null,null,null,{"$f":"FeedRaws!F80","v":"Minerals"}]
[null,null,null,null,{"$f":"FeedRaws!G81","v":"Choline Chloride"}]
[null,null,null,null,{"$f":"FeedRaws!G82","v":"Copper Sulphate"}]
[null,null,null,null,{"$f":"FeedRaws!G83","v":"Dicalphos"},null,null,null,null,null,null,null,null,null,0.85,null,null,0.12,0.85,null,null,null,0.44,null,null,0.41,0.57999999999999996]
[null,null,null,null,{"$f":"FeedRaws!G84","v":"Ferrous Sulphate"}]
[null,null,null,null,{"$f":"FeedRaws!G85","v":"Kynofos"}]
[null,null,null,null,{"$f":"FeedRaws!G86","v":"Limestone"}]
[null,null,null,null,{"$f":"FeedRaws!G87","v":"Potassium Choride"}]
[null,null,null,null,{"$f":"FeedRaws!G88","v":"Potassium sulphate"}]
[null,null,null,null,{"$f":"FeedRaws!G89","v":"Salt"},null,null,null,0.2,null,null,null,0.25,0.25,0.25,null,null,0.25,0.25,null,null,0.25,0.25,null,null,0.25,0.25]
[null,null,null,null,{"$f":"FeedRaws!G90","v":"Zinc Oxide"}]
[null,null,null,{"$f":"FeedRaws!F91","v":"Synthetic amino acids"}]
[null,null,null,null,{"$f":"FeedRaws!G92","v":"L-Lysine HCL"},null,null,null,0.17,null,null,null,0.19,0.14000000000000001,0.22,null,null,0.1,0.16]
[null,null,null,null,{"$f":"FeedRaws!G93","v":"DL-Methionie"},null,null,null,0.02,null,null,null,null,null,0.08,null,null,null,0.04,null,null,null,null,null,null,0.02,0.04]
[null,null,null,null,{"$f":"FeedRaws!G94","v":"L-Threonine"},null,null,null,0.06,null,null,null,null,null,0.02,null,null,null,null,null,null,7.0000000000000007E-2,7.0000000000000007E-2]
[null,null,null,null,{"$f":"FeedRaws!G95","v":"L-Tryptophan"}]
[null,null,null,{"$f":"FeedRaws!F96","v":"Micellaneous ingredients"}]
[null,null,null,{"$f":"FeedRaws!F97","v":0},{"$f":"FeedRaws!G97","v":"Bentonite"}]
[null,null,null,{"$f":"FeedRaws!F98","v":"Vitamin/mineral premixes"}]
[null,null,null,null,{"$f":"FeedRaws!G99","v":"Breeder premix"}]
[null,null,null,null,{"$f":"FeedRaws!G100","v":"Grower premix"}]
[null,null,null,null,{"$f":"FeedRaws!G101","v":"Weaner premix"}]
[null,null,null,null,{"$f":"FeedRaws!G102","v":"Bioplex Sow Pak"}]
[null,null,null,{"$f":"FeedRaws!F103","v":"Enzymes"}]
[null,null,null,null,{"$f":"FeedRaws!G104","v":"FEEDZYME (1 kg dose)"}]
[null,null,null,null,{"$f":"FeedRaws!G105","v":"Kemzyme"}]
[null,null,null,null,{"$f":"FeedRaws!G106","v":"Phyzyme (500 FTU OR 100g dose)"}]
[null,null,null,null,{"$f":"FeedRaws!G107","v":"Phyzyme (1000 FTU OR 200g dose)"}]
[null,null,null,null,{"$f":"FeedRaws!G108","v":"Ronozyme P 5000 (150g dose)"}]
[null,null,null,null,{"$f":"FeedRaws!G109","v":"Rovabio Excel premix"}]
[null,null,null,null,{"$f":"FeedRaws!G110","v":"Allzyme SSF"}]
[null,null,null,{"$f":"FeedRaws!F111","v":"Toxin Binders"}]
[null,null,null,null,{"$f":"FeedRaws!G112","v":"Biofix"}]
[null,null,null,null,{"$f":"FeedRaws!G113","v":"Mycofix"}]
[null,null,null,null,{"$f":"FeedRaws!G114","v":"Mycosorb"},null,null,null,null,null,null,null,null,null,null,null,null,null,null,null,null,null,null,null,null,null,null,null,null," "]
[null,null,null,null,{"$f":"FeedRaws!G115","v":"Elitox"}]
[null,null,null,null,{"$f":"FeedRaws!G116","v":"Kembind"}]
[null,null,null,{"$f":"FeedRaws!F117","v":"Acidifiers"}]
[null,null,null,null,{"$f":"FeedRaws!G118","v":"Biotronic SE (Biomin)"}]
[null,null,null,null,{"$f":"FeedRaws!G119","v":"Tetracid 500"}]
[null,null,null,null,{"$f":"FeedRaws!G120","v":"AcidLac"}]
[null,null,null,null,{"$f":"FeedRaws!G121","v":"Acid-Pak 4Way"}]
[null,null,null,{"$f":"FeedRaws!F122","v":"Other Additives"}]
[null,null,null,null,{"$f":"FeedRaws!G123","v":"Biomin® pHD"}]
[null,null,null,null,{"$f":"FeedRaws!G124","v":"Betaine (Betafin)"}]
[null,null,null,null,{"$f":"FeedRaws!G125","v":"Biomos"}]
[null,null,null,null,{"$f":"FeedRaws!G126","v":"De-Oderase"}]
[null,null,null,null,{"$f":"FeedRaws!G127","v":"Paylean"}]
[null,null,null,{"$f":"FeedRaws!F128","v":"Additional Raw Materials"}]
[null,null,null,null,{"$f":"FeedRaws!G129","v":0}]
[null,null,null,null,{"$f":"FeedRaws!G130","v":0}]
[null,null,null,null,{"$f":"FeedRaws!G131","v":0}]
[null,null,null,null,{"$f":"FeedRaws!G132","v":0}]
[null,null,null,null,{"$f":"FeedRaws!G133","v":0}]
[null,null,null,null,{"$f":"FeedRaws!G134","v":0}]
[null,null,null,null,{"$f":"FeedRaws!G135","v":0}]
[null,null,null,null,{"$f":"FeedRaws!G136","v":0}]
[null,null,null,null,{"$f":"FeedRaws!G137","v":0}]
[null,null,null,null,{"$f":"FeedRaws!G138","v":0}]
[null,null,null,null,{"$f":"FeedRaws!G139","v":0}]
[null,null,null,null,{"$f":"FeedRaws!G140","v":0}]
[null,null,null,null,{"$f":"FeedRaws!G141","v":0}]
[null,null,null,{"$f":"FeedRaws!F142","v":"Complete Diets"}]
[null,null,null,null,{"$f":"FeedRaws!G143","v":0}," "]
[null,null,null,null,{"$f":"FeedRaws!G144","v":0}]
[null,null,null,null,{"$f":"FeedRaws!G145","v":0}]
[null,null,null,null,{"$f":"FeedRaws!G146","v":0}]
[null,null,null,null,{"$f":"FeedRaws!G147","v":0}]
[null,null,null,null,{"$f":"FeedRaws!G148","v":0}]
[null,null,null,null,{"$f":"FeedRaws!G149","v":0}]
[null,null,null,null,{"$f":"FeedRaws!G150","v":0}]
[null,null,null,null,{"$f":"FeedRaws!G151","v":0}]
[null,null,null,null,{"$f":"FeedRaws!G152","v":0}]
[null,null,null,null,{"$f":"FeedRaws!G153","v":0}]
[null,null,null,null,{"$f":"FeedRaws!G154","v":0}]
[null,null,null,null,{"$f":"FeedRaws!G155","v":0}]
[null,null,null,null,{"$f":"FeedRaws!G156","v":0}]
[null,null,null,null,{"$f":"FeedRaws!G157","v":0}]
[null,null,null,null,{"$f":"FeedRaws!G158","v":0}]
[null,null,null,null,{"$f":"FeedRaws!G159","v":0}]
[null,null,null,null,{"$f":"FeedRaws!G160","v":0}]
[null,null,null,null,{"$f":"FeedRaws!G161","v":0}]
[null,null,null,null,{"$f":"FeedRaws!G162","v":0}]
[null,null,null,null,{"$f":"FeedRaws!G163","v":0}]
[null,null,null,null,{"$f":"FeedRaws!G164","v":0}]
[null,null,null,null,{"$f":"FeedRaws!G165","v":0}]
[null,null,null,null,{"$f":"FeedRaws!G166","v":0}]
[null,null,null,null,{"$f":"FeedRaws!G167","v":0}]
[null,null,null,null,{"$f":"FeedRaws!G168","v":0}]
[null,null,null,null,{"$f":"FeedRaws!G169","v":0}]
[null,null,null,null,{"$f":"FeedRaws!G170","v":0}]
[null,null,null,null,{"$f":"FeedRaws!G171","v":0}]
[null,null,null,null,{"$f":"FeedRaws!G172","v":0}]
[null,null,null,null,{"$f":"FeedRaws!G173","v":0}]
[null,null,null,null,{"$f":"FeedRaws!G174","v":0}]
[null,null,null,null,{"$f":"FeedRaws!G175","v":0}]
[null,null,null,null,{"$f":"FeedRaws!G176","v":0}]
[null,null,null,null,{"$f":"FeedRaws!G177","v":0}]
[null,null,null,null,{"$f":"FeedRaws!G178","v":0}]
[null,null,null,null,{"$f":"FeedRaws!G179","v":0}]
[null,null,null,null,{"$f":"FeedRaws!G180","v":0}]
[null,null,null,null,{"$f":"FeedRaws!G181","v":0}]
[null,null,null,null,{"$f":"FeedRaws!G182","v":0}]
[null,null,null,null,{"$f":"FeedRaws!G183","v":0}]
[null,null,null,null,{"$f":"FeedRaws!G184","v":0}]
[null,null,null,null,{"$f":"FeedRaws!G185","v":0}]
[null,null,null,null,{"$f":"FeedRaws!G186","v":0}]
[null,null,null,null,{"$f":"FeedRaws!G187","v":0}]
[null,null,null,null,{"$f":"FeedRaws!G188","v":0}]
[null,null,null,null,{"$f":"FeedRaws!G189","v":0}]
[null,null,null,null,{"$f":"FeedRaws!G190","v":0}]
[null,null,null,null,{"$f":"FeedRaws!G191","v":0}]
[null,null,null,null,{"$f":"FeedRaws!G192","v":0}]
[null,null,null,null,{"$f":"FeedRaws!G193","v":0}]
[null,null,null,null,{"$f":"FeedRaws!G194","v":0}]
[null,null,null,null,{"$f":"FeedRaws!G195","v":0}]
[null,null,null,null,{"$f":"FeedRaws!G196","v":0}]
[null,null,null,null,{"$f":"FeedRaws!G197","v":0}]
[null,null,null,null,{"$f":"FeedRaws!G198","v":0}]
[null,null,null,null,{"$f":"FeedRaws!G199","v":0}]
[null,null,null,null,{"$f":"FeedRaws!G200","v":0}]
[null,null,null,null,{"$f":"FeedRaws!G201","v":0}]
[null,null,null,null,{"$f":"FeedRaws!G202","v":0}]
[]
[]
[null,null,"Feed",null,"Total Solids %",{"$f":"SUMPRODUCT(F13:F209,FeedRaws!$H$6:$H$202)/$F$4","v":0},{"$f":"SUMPRODUCT(G13:G209,FeedRaws!$H$6:$H$202)/$F$4","v":0},{"$f":"SUMPRODUCT(H13:H209,FeedRaws!$H$6:$H$202)/$F$4","v":0},{"$f":"SUMPRODUCT(I13:I209,FeedRaws!$H$6:$H$202)/$F$4","v":89.27225},{"$f":"SUMPRODUCT(J13:J209,FeedRaws!$H$6:$H$202)/$F$4","v":0},{"$f":"SUMPRODUCT(K13:K209,FeedRaws!$H$6:$H$202)/$F$4","v":0},{"$f":"SUMPRODUCT(L13:L209,FeedRaws!$H$6:$H$202)/$F$4","v":0},{"$f":"SUMPRODUCT(M13:M209,FeedRaws!$H$6:$H$202)/$F$4","v":88.629750000000001},{"$f":"SUMPRODUCT(N13:N209,FeedRaws!$H$6:$H$202)/$F$4","v":88.419899999999998},{"$f":"SUMPRODUCT(O13:O209,FeedRaws!$H$6:$H$202)/$F$4","v":88.510299999999987},{"$f":"SUMPRODUCT(P13:P209,FeedRaws!$H$6:$H$202)/$F$4","v":0},{"$f":"SUMPRODUCT(Q13:Q209,FeedRaws!$H$6:$H$202)/$F$4","v":0},{"$f":"SUMPRODUCT(R13:R209,FeedRaws!$H$6:$H$202)/$F$4","v":88.380899999999997},{"$f":"SUMPRODUCT(S13:S209,FeedRaws!$H$6:$H$202)/$F$4","v":88.465000000000003},{"$f":"SUMPRODUCT(T13:T209,FeedRaws!$H$6:$H$202)/$F$4","v":0},{"$f":"SUMPRODUCT(U13:U209,FeedRaws!$H$6:$H$202)/$F$4","v":0},{"$f":"SUMPRODUCT(V13:V209,FeedRaws!$H$6:$H$202)/$F$4","v":88.629249999999999},{"$f":"SUMPRODUCT(W13:W209,FeedRaws!$H$6:$H$202)/$F$4","v":88.743549999999999},{"$f":"SUMPRODUCT(X13:X209,FeedRaws!$H$6:$H$202)/$F$4","v":0},{"$f":"SUMPRODUCT(Y13:Y209,FeedRaws!$H$6:$H$202)/$F$4","v":0},{"$f":"SUMPRODUCT(Z13:Z209,FeedRaws!$H$6:$H$202)/$F$4","v":88.381500000000003},{"$f":"SUMPRODUCT(AA13:AA209,FeedRaws!$H$6:$H$202)/$F$4","v":88.379199999999983},{"$f":"SUMPRODUCT(AB13:AB209,FeedRaws!$H$6:$H$202)/$F$4","v":0},{"$f":"SUMPRODUCT(AC13:AC209,FeedRaws!$H$6:$H$202)/$F$4","v":0},{"$f":"SUMPRODUCT(AD13:AD209,FeedRaws!$H$6:$H$202)/$F$4","v":0},{"$f":"SUMPRODUCT(AE13:AE209,FeedRaws!$H$6:$H$202)/$F$4","v":0},{"$f":"SUMPRODUCT(AF13:AF209,FeedRaws!$H$6:$H$202)/$F$4","v":0},{"$f":"SUMPRODUCT(AG13:AG209,FeedRaws!$H$6:$H$202)/$F$4","v":0},{"$f":"SUMPRODUCT(AH13:AH209,FeedRaws!$H$6:$H$202)/$F$4","v":0},{"$f":"SUMPRODUCT(AI13:AI209,FeedRaws!$H$6:$H$202)/$F$4","v":0},{"$f":"SUMPRODUCT(AJ13:AJ209,FeedRaws!$H$6:$H$202)/$F$4","v":0},{"$f":"SUMPRODUCT(AK13:AK209,FeedRaws!$H$6:$H$202)/$F$4","v":0},{"$f":"SUMPRODUCT(AL13:AL209,FeedRaws!$H$6:$H$202)/$F$4","v":0},{"$f":"SUMPRODUCT(AM13:AM209,FeedRaws!$H$6:$H$202)/$F$4","v":0},{"$f":"SUMPRODUCT(AN13:AN209,FeedRaws!$H$6:$H$202)/$F$4","v":0},{"$f":"SUMPRODUCT(AO13:AO209,FeedRaws!$H$6:$H$202)/$F$4","v":0},{"$f":"SUMPRODUCT(AP13:AP209,FeedRaws!$H$6:$H$202)/$F$4","v":0},{"$f":"SUMPRODUCT(AQ13:AQ209,FeedRaws!$H$6:$H$202)/$F$4","v":0},{"$f":"SUMPRODUCT(AR13:AR209,FeedRaws!$H$6:$H$202)/$F$4","v":0},{"$f":"SUMPRODUCT(AS13:AS209,FeedRaws!$H$6:$H$202)/$F$4","v":0}]
[null,null,null,null,"Fixed Solids %",{"$f":"SUMPRODUCT(F13:F209,FeedRaws!$O$6:$O$202)/$F$4","v":0},{"$f":"SUMPRODUCT(G13:G209,FeedRaws!$O$6:$O$202)/$F$4","v":0},{"$f":"SUMPRODUCT(H13:H209,FeedRaws!$O$6:$O$202)/$F$4","v":0},{"$f":"SUMPRODUCT(I13:I209,FeedRaws!$O$6:$O$202)/$F$4","v":5.3697400000000002},{"$f":"SUMPRODUCT(J13:J209,FeedRaws!$O$6:$O$202)/$F$4","v":0},{"$f":"SUMPRODUCT(K13:K209,FeedRaws!$O$6:$O$202)/$F$4","v":0},{"$f":"SUMPRODUCT(L13:L209,FeedRaws!$O$6:$O$202)/$F$4","v":0},{"$f":"SUMPRODUCT(M13:M209,FeedRaws!$O$6:$O$202)/$F$4","v":4.5475400000000006},{"$f":"SUMPRODUCT(N13:N209,FeedRaws!$O$6:$O$202)/$F$4","v":4.3298030000000001},{"$f":"SUMPRODUCT(O13:O209,FeedRaws!$O$6:$O$202)/$F$4","v":4.84131},{"$f":"SUMPRODUCT(P13:P209,FeedRaws!$O$6:$O$202)/$F$4","v":0},{"$f":"SUMPRODUCT(Q13:Q209,FeedRaws!$O$6:$O$202)/$F$4","v":0},{"$f":"SUMPRODUCT(R13:R209,FeedRaws!$O$6:$O$202)/$F$4","v":4.6527099999999999},{"$f":"SUMPRODUCT(S13:S209,FeedRaws!$O$6:$O$202)/$F$4","v":4.8420800000000002},{"$f":"SUMPRODUCT(T13:T209,FeedRaws!$O$6:$O$202)/$F$4","v":0},{"$f":"SUMPRODUCT(U13:U209,FeedRaws!$O$6:$O$202)/$F$4","v":0},{"$f":"SUMPRODUCT(V13:V209,FeedRaws!$O$6:$O$202)/$F$4","v":4.1412500000000003},{"$f":"SUMPRODUCT(W13:W209,FeedRaws!$O$6:$O$202)/$F$4","v":4.5555250000000003},{"$f":"SUMPRODUCT(X13:X209,FeedRaws!$O$6:$O$202)/$F$4","v":0},{"$f":"SUMPRODUCT(Y13:Y209,FeedRaws!$O$6:$O$202)/$F$4","v":0},{"$f":"SUMPRODUCT(Z13:Z209,FeedRaws!$O$6:$O$202)/$F$4","v":4.5350900000000003},{"$f":"SUMPRODUCT(AA13:AA209,FeedRaws!$O$6:$O$202)/$F$4","v":4.6132549999999997},{"$f":"SUMPRODUCT(AB13:AB209,FeedRaws!$O$6:$O$202)/$F$4","v":0},{"$f":"SUMPRODUCT(AC13:AC209,FeedRaws!$O$6:$O$202)/$F$4","v":0},{"$f":"SUMPRODUCT(AD13:AD209,FeedRaws!$O$6:$O$202)/$F$4","v":0},{"$f":"SUMPRODUCT(AE13:AE209,FeedRaws!$O$6:$O$202)/$F$4","v":0},{"$f":"SUMPRODUCT(AF13:AF209,FeedRaws!$O$6:$O$202)/$F$4","v":0},{"$f":"SUMPRODUCT(AG13:AG209,FeedRaws!$O$6:$O$202)/$F$4","v":0},{"$f":"SUMPRODUCT(AH13:AH209,FeedRaws!$O$6:$O$202)/$F$4","v":0},{"$f":"SUMPRODUCT(AI13:AI209,FeedRaws!$O$6:$O$202)/$F$4","v":0},{"$f":"SUMPRODUCT(AJ13:AJ209,FeedRaws!$O$6:$O$202)/$F$4","v":0},{"$f":"SUMPRODUCT(AK13:AK209,FeedRaws!$O$6:$O$202)/$F$4","v":0},{"$f":"SUMPRODUCT(AL13:AL209,FeedRaws!$O$6:$O$202)/$F$4","v":0},{"$f":"SUMPRODUCT(AM13:AM209,FeedRaws!$O$6:$O$202)/$F$4","v":0},{"$f":"SUMPRODUCT(AN13:AN209,FeedRaws!$O$6:$O$202)/$F$4","v":0},{"$f":"SUMPRODUCT(AO13:AO209,FeedRaws!$O$6:$O$202)/$F$4","v":0},{"$f":"SUMPRODUCT(AP13:AP209,FeedRaws!$O$6:$O$202)/$F$4","v":0},{"$f":"SUMPRODUCT(AQ13:AQ209,FeedRaws!$O$6:$O$202)/$F$4","v":0},{"$f":"SUMPRODUCT(AR13:AR209,FeedRaws!$O$6:$O$202)/$F$4","v":0},{"$f":"SUMPRODUCT(AS13:AS209,FeedRaws!$O$6:$O$202)/$F$4","v":0}]
[null,null,null,null,"Volatile S%",{"$f":"F212-F213","v":0},0,0,83.902510000000007,0,0,0,84.082210000000003,84.090097,83.66898999999998,0,0,83.728189999999998,83.622920000000008,0,0,84.488,84.188024999999996,0,0,83.846410000000006,83.765944999999988,0,0,0,0,0,0,0,0,0,0,0,0,0,0,0,0,0,0]
[null,null,null,null,"N",{"$f":"SUMPRODUCT(F13:F209,FeedRaws!$M$6:$M$202)/$F$4","v":0},{"$f":"SUMPRODUCT(G13:G209,FeedRaws!$M$6:$M$202)/$F$4","v":0},{"$f":"SUMPRODUCT(H13:H209,FeedRaws!$M$6:$M$202)/$F$4","v":0},{"$f":"SUMPRODUCT(I13:I209,FeedRaws!$M$6:$M$202)/$F$4","v":3.6336380799999994},{"$f":"SUMPRODUCT(J13:J209,FeedRaws!$M$6:$M$202)/$F$4","v":0},{"$f":"SUMPRODUCT(K13:K209,FeedRaws!$M$6:$M$202)/$F$4","v":0},{"$f":"SUMPRODUCT(L13:L209,FeedRaws!$M$6:$M$202)/$F$4","v":0},{"$f":"SUMPRODUCT(M13:M209,FeedRaws!$M$6:$M$202)/$F$4","v":3.1741776000000006},{"$f":"SUMPRODUCT(N13:N209,FeedRaws!$M$6:$M$202)/$F$4","v":3.1044175999999997},{"$f":"SUMPRODUCT(O13:O209,FeedRaws!$M$6:$M$202)/$F$4","v":3.0366841600000005},{"$f":"SUMPRODUCT(P13:P209,FeedRaws!$M$6:$M$202)/$F$4","v":0},{"$f":"SUMPRODUCT(Q13:Q209,FeedRaws!$M$6:$M$202)/$F$4","v":0},{"$f":"SUMPRODUCT(R13:R209,FeedRaws!$M$6:$M$202)/$F$4","v":2.8958400000000002},{"$f":"SUMPRODUCT(S13:S209,FeedRaws!$M$6:$M$202)/$F$4","v":2.9668800000000006},{"$f":"SUMPRODUCT(T13:T209,FeedRaws!$M$6:$M$202)/$F$4","v":0},{"$f":"SUMPRODUCT(U13:U209,FeedRaws!$M$6:$M$202)/$F$4","v":0},{"$f":"SUMPRODUCT(V13:V209,FeedRaws!$M$6:$M$202)/$F$4","v":2.7547025600000001},{"$f":"SUMPRODUCT(W13:W209,FeedRaws!$M$6:$M$202)/$F$4","v":2.7720385600000004},{"$f":"SUMPRODUCT(X13:X209,FeedRaws!$M$6:$M$202)/$F$4","v":0},{"$f":"SUMPRODUCT(Y13:Y209,FeedRaws!$M$6:$M$202)/$F$4","v":0},{"$f":"SUMPRODUCT(Z13:Z209,FeedRaws!$M$6:$M$202)/$F$4","v":2.3387007999999998},{"$f":"SUMPRODUCT(AA13:AA209,FeedRaws!$M$6:$M$202)/$F$4","v":2.3364256000000001},{"$f":"SUMPRODUCT(AB13:AB209,FeedRaws!$M$6:$M$202)/$F$4","v":0},{"$f":"SUMPRODUCT(AC13:AC209,FeedRaws!$M$6:$M$202)/$F$4","v":0},{"$f":"SUMPRODUCT(AD13:AD209,FeedRaws!$M$6:$M$202)/$F$4","v":0},{"$f":"SUMPRODUCT(AE13:AE209,FeedRaws!$M$6:$M$202)/$F$4","v":0},{"$f":"SUMPRODUCT(AF13:AF209,FeedRaws!$M$6:$M$202)/$F$4","v":0},{"$f":"SUMPRODUCT(AG13:AG209,FeedRaws!$M$6:$M$202)/$F$4","v":0},{"$f":"SUMPRODUCT(AH13:AH209,FeedRaws!$M$6:$M$202)/$F$4","v":0},{"$f":"SUMPRODUCT(AI13:AI209,FeedRaws!$M$6:$M$202)/$F$4","v":0},{"$f":"SUMPRODUCT(AJ13:AJ209,FeedRaws!$M$6:$M$202)/$F$4","v":0},{"$f":"SUMPRODUCT(AK13:AK209,FeedRaws!$M$6:$M$202)/$F$4","v":0},{"$f":"SUMPRODUCT(AL13:AL209,FeedRaws!$M$6:$M$202)/$F$4","v":0},{"$f":"SUMPRODUCT(AM13:AM209,FeedRaws!$M$6:$M$202)/$F$4","v":0},{"$f":"SUMPRODUCT(AN13:AN209,FeedRaws!$M$6:$M$202)/$F$4","v":0},{"$f":"SUMPRODUCT(AO13:AO209,FeedRaws!$M$6:$M$202)/$F$4","v":0},{"$f":"SUMPRODUCT(AP13:AP209,FeedRaws!$M$6:$M$202)/$F$4","v":0},{"$f":"SUMPRODUCT(AQ13:AQ209,FeedRaws!$M$6:$M$202)/$F$4","v":0},{"$f":"SUMPRODUCT(AR13:AR209,FeedRaws!$M$6:$M$202)/$F$4","v":0},{"$f":"SUMPRODUCT(AS13:AS209,FeedRaws!$M$6:$M$202)/$F$4","v":0}]
[null,null,null,null,"P",{"$f":"SUMPRODUCT(F13:F209,FeedRaws!$P$6:$P$202)/$F$4","v":0},{"$f":"SUMPRODUCT(G13:G209,FeedRaws!$P$6:$P$202)/$F$4","v":0},{"$f":"SUMPRODUCT(H13:H209,FeedRaws!$P$6:$P$202)/$F$4","v":0},{"$f":"SUMPRODUCT(I13:I209,FeedRaws!$P$6:$P$202)/$F$4","v":0.84895000000000009},{"$f":"SUMPRODUCT(J13:J209,FeedRaws!$P$6:$P$202)/$F$4","v":0},{"$f":"SUMPRODUCT(K13:K209,FeedRaws!$P$6:$P$202)/$F$4","v":0},{"$f":"SUMPRODUCT(L13:L209,FeedRaws!$P$6:$P$202)/$F$4","v":0},{"$f":"SUMPRODUCT(M13:M209,FeedRaws!$P$6:$P$202)/$F$4","v":0.70373799999999997},{"$f":"SUMPRODUCT(N13:N209,FeedRaws!$P$6:$P$202)/$F$4","v":0.66055700000000017},{"$f":"SUMPRODUCT(O13:O209,FeedRaws!$P$6:$P$202)/$F$4","v":0.70083399999999996},{"$f":"SUMPRODUCT(P13:P209,FeedRaws!$P$6:$P$202)/$F$4","v":0},{"$f":"SUMPRODUCT(Q13:Q209,FeedRaws!$P$6:$P$202)/$F$4","v":0},{"$f":"SUMPRODUCT(R13:R209,FeedRaws!$P$6:$P$202)/$F$4","v":0.69812199999999991},{"$f":"SUMPRODUCT(S13:S209,FeedRaws!$P$6:$P$202)/$F$4","v":0.70194000000000001},{"$f":"SUMPRODUCT(T13:T209,FeedRaws!$P$6:$P$202)/$F$4","v":0},{"$f":"SUMPRODUCT(U13:U209,FeedRaws!$P$6:$P$202)/$F$4","v":0},{"$f":"SUMPRODUCT(V13:V209,FeedRaws!$P$6:$P$202)/$F$4","v":0.62367600000000001},{"$f":"SUMPRODUCT(W13:W209,FeedRaws!$P$6:$P$202)/$F$4","v":0.66234199999999999},{"$f":"SUMPRODUCT(X13:X209,FeedRaws!$P$6:$P$202)/$F$4","v":0},{"$f":"SUMPRODUCT(Y13:Y209,FeedRaws!$P$6:$P$202)/$F$4","v":0},{"$f":"SUMPRODUCT(Z13:Z209,FeedRaws!$P$6:$P$202)/$F$4","v":0.710812},{"$f":"SUMPRODUCT(AA13:AA209,FeedRaws!$P$6:$P$202)/$F$4","v":0.71240800000000004},{"$f":"SUMPRODUCT(AB13:AB209,FeedRaws!$P$6:$P$202)/$F$4","v":0},{"$f":"SUMPRODUCT(AC13:AC209,FeedRaws!$P$6:$P$202)/$F$4","v":0},{"$f":"SUMPRODUCT(AD13:AD209,FeedRaws!$P$6:$P$202)/$F$4","v":0},{"$f":"SUMPRODUCT(AE13:AE209,FeedRaws!$P$6:$P$202)/$F$4","v":0},{"$f":"SUMPRODUCT(AF13:AF209,FeedRaws!$P$6:$P$202)/$F$4","v":0},{"$f":"SUMPRODUCT(AG13:AG209,FeedRaws!$P$6:$P$202)/$F$4","v":0},{"$f":"SUMPRODUCT(AH13:AH209,FeedRaws!$P$6:$P$202)/$F$4","v":0},{"$f":"SUMPRODUCT(AI13:AI209,FeedRaws!$P$6:$P$202)/$F$4","v":0},{"$f":"SUMPRODUCT(AJ13:AJ209,FeedRaws!$P$6:$P$202)/$F$4","v":0},{"$f":"SUMPRODUCT(AK13:AK209,FeedRaws!$P$6:$P$202)/$F$4","v":0},{"$f":"SUMPRODUCT(AL13:AL209,FeedRaws!$P$6:$P$202)/$F$4","v":0},{"$f":"SUMPRODUCT(AM13:AM209,FeedRaws!$P$6:$P$202)/$F$4","v":0},{"$f":"SUMPRODUCT(AN13:AN209,FeedRaws!$P$6:$P$202)/$F$4","v":0},{"$f":"SUMPRODUCT(AO13:AO209,FeedRaws!$P$6:$P$202)/$F$4","v":0},{"$f":"SUMPRODUCT(AP13:AP209,FeedRaws!$P$6:$P$202)/$F$4","v":0},{"$f":"SUMPRODUCT(AQ13:AQ209,FeedRaws!$P$6:$P$202)/$F$4","v":0},{"$f":"SUMPRODUCT(AR13:AR209,FeedRaws!$P$6:$P$202)/$F$4","v":0},{"$f":"SUMPRODUCT(AS13:AS209,FeedRaws!$P$6:$P$202)/$F$4","v":0}]
[null,null,null,null,"K",{"$f":"SUMPRODUCT(F13:F209,FeedRaws!$S$6:$S$202)/$F$4","v":0},{"$f":"SUMPRODUCT(G13:G209,FeedRaws!$S$6:$S$202)/$F$4","v":0},{"$f":"SUMPRODUCT(H13:H209,FeedRaws!$S$6:$S$202)/$F$4","v":0},{"$f":"SUMPRODUCT(I13:I209,FeedRaws!$S$6:$S$202)/$F$4","v":0.65817499999999995},{"$f":"SUMPRODUCT(J13:J209,FeedRaws!$S$6:$S$202)/$F$4","v":0},{"$f":"SUMPRODUCT(K13:K209,FeedRaws!$S$6:$S$202)/$F$4","v":0},{"$f":"SUMPRODUCT(L13:L209,FeedRaws!$S$6:$S$202)/$F$4","v":0},{"$f":"SUMPRODUCT(M13:M209,FeedRaws!$S$6:$S$202)/$F$4","v":0.61284700000000003},{"$f":"SUMPRODUCT(N13:N209,FeedRaws!$S$6:$S$202)/$F$4","v":0.59034500000000001},{"$f":"SUMPRODUCT(O13:O209,FeedRaws!$S$6:$S$202)/$F$4","v":0.53575499999999998},{"$f":"SUMPRODUCT(P13:P209,FeedRaws!$S$6:$S$202)/$F$4","v":0},{"$f":"SUMPRODUCT(Q13:Q209,FeedRaws!$S$6:$S$202)/$F$4","v":0},{"$f":"SUMPRODUCT(R13:R209,FeedRaws!$S$6:$S$202)/$F$4","v":0.614923},{"$f":"SUMPRODUCT(S13:S209,FeedRaws!$S$6:$S$202)/$F$4","v":0.53715000000000002},{"$f":"SUMPRODUCT(T13:T209,FeedRaws!$S$6:$S$202)/$F$4","v":0},{"$f":"SUMPRODUCT(U13:U209,FeedRaws!$S$6:$S$202)/$F$4","v":0},{"$f":"SUMPRODUCT(V13:V209,FeedRaws!$S$6:$S$202)/$F$4","v":0.5731719999999999},{"$f":"SUMPRODUCT(W13:W209,FeedRaws!$S$6:$S$202)/$F$4","v":0.57509900000000003},{"$f":"SUMPRODUCT(X13:X209,FeedRaws!$S$6:$S$202)/$F$4","v":0},{"$f":"SUMPRODUCT(Y13:Y209,FeedRaws!$S$6:$S$202)/$F$4","v":0},{"$f":"SUMPRODUCT(Z13:Z209,FeedRaws!$S$6:$S$202)/$F$4","v":0.50965399999999994},{"$f":"SUMPRODUCT(AA13:AA209,FeedRaws!$S$6:$S$202)/$F$4","v":0.51451099999999994},{"$f":"SUMPRODUCT(AB13:AB209,FeedRaws!$S$6:$S$202)/$F$4","v":0},{"$f":"SUMPRODUCT(AC13:AC209,FeedRaws!$S$6:$S$202)/$F$4","v":0},{"$f":"SUMPRODUCT(AD13:AD209,FeedRaws!$S$6:$S$202)/$F$4","v":0},{"$f":"SUMPRODUCT(AE13:AE209,FeedRaws!$S$6:$S$202)/$F$4","v":0},{"$f":"SUMPRODUCT(AF13:AF209,FeedRaws!$S$6:$S$202)/$F$4","v":0},{"$f":"SUMPRODUCT(AG13:AG209,FeedRaws!$S$6:$S$202)/$F$4","v":0},{"$f":"SUMPRODUCT(AH13:AH209,FeedRaws!$S$6:$S$202)/$F$4","v":0},{"$f":"SUMPRODUCT(AI13:AI209,FeedRaws!$S$6:$S$202)/$F$4","v":0},{"$f":"SUMPRODUCT(AJ13:AJ209,FeedRaws!$S$6:$S$202)/$F$4","v":0},{"$f":"SUMPRODUCT(AK13:AK209,FeedRaws!$S$6:$S$202)/$F$4","v":0},{"$f":"SUMPRODUCT(AL13:AL209,FeedRaws!$S$6:$S$202)/$F$4","v":0},{"$f":"SUMPRODUCT(AM13:AM209,FeedRaws!$S$6:$S$202)/$F$4","v":0},{"$f":"SUMPRODUCT(AN13:AN209,FeedRaws!$S$6:$S$202)/$F$4","v":0},{"$f":"SUMPRODUCT(AO13:AO209,FeedRaws!$S$6:$S$202)/$F$4","v":0},{"$f":"SUMPRODUCT(AP13:AP209,FeedRaws!$S$6:$S$202)/$F$4","v":0},{"$f":"SUMPRODUCT(AQ13:AQ209,FeedRaws!$S$6:$S$202)/$F$4","v":0},{"$f":"SUMPRODUCT(AR13:AR209,FeedRaws!$S$6:$S$202)/$F$4","v":0},{"$f":"SUMPRODUCT(AS13:AS209,FeedRaws!$S$6:$S$202)/$F$4","v":0}]
[null,null,null,null,"Dry Matter %",{"$f":"SUMPRODUCT(F13:F209,FeedRaws!$H$6:$H$202)/$F$4","v":0},{"$f":"SUMPRODUCT(G13:G209,FeedRaws!$H$6:$H$202)/$F$4","v":0},{"$f":"SUMPRODUCT(H13:H209,FeedRaws!$H$6:$H$202)/$F$4","v":0},{"$f":"SUMPRODUCT(I13:I209,FeedRaws!$H$6:$H$202)/$F$4","v":89.27225},{"$f":"SUMPRODUCT(J13:J209,FeedRaws!$H$6:$H$202)/$F$4","v":0},{"$f":"SUMPRODUCT(K13:K209,FeedRaws!$H$6:$H$202)/$F$4","v":0},{"$f":"SUMPRODUCT(L13:L209,FeedRaws!$H$6:$H$202)/$F$4","v":0},{"$f":"SUMPRODUCT(M13:M209,FeedRaws!$H$6:$H$202)/$F$4","v":88.629750000000001},{"$f":"SUMPRODUCT(N13:N209,FeedRaws!$H$6:$H$202)/$F$4","v":88.419899999999998},{"$f":"SUMPRODUCT(O13:O209,FeedRaws!$H$6:$H$202)/$F$4","v":88.510299999999987},{"$f":"SUMPRODUCT(P13:P209,FeedRaws!$H$6:$H$202)/$F$4","v":0},{"$f":"SUMPRODUCT(Q13:Q209,FeedRaws!$H$6:$H$202)/$F$4","v":0},{"$f":"SUMPRODUCT(R13:R209,FeedRaws!$H$6:$H$202)/$F$4","v":88.380899999999997},{"$f":"SUMPRODUCT(S13:S209,FeedRaws!$H$6:$H$202)/$F$4","v":88.465000000000003},{"$f":"SUMPRODUCT(T13:T209,FeedRaws!$H$6:$H$202)/$F$4","v":0},{"$f":"SUMPRODUCT(U13:U209,FeedRaws!$H$6:$H$202)/$F$4","v":0},{"$f":"SUMPRODUCT(V13:V209,FeedRaws!$H$6:$H$202)/$F$4","v":88.629249999999999},{"$f":"SUMPRODUCT(W13:W209,FeedRaws!$H$6:$H$202)/$F$4","v":88.743549999999999},{"$f":"SUMPRODUCT(X13:X209,FeedRaws!$H$6:$H$202)/$F$4","v":0},{"$f":"SUMPRODUCT(Y13:Y209,FeedRaws!$H$6:$H$202)/$F$4","v":0},{"$f":"SUMPRODUCT(Z13:Z209,FeedRaws!$H$6:$H$202)/$F$4","v":88.381500000000003},{"$f":"SUMPRODUCT(AA13:AA209,FeedRaws!$H$6:$H$202)/$F$4","v":88.379199999999983},{"$f":"SUMPRODUCT(AB13:AB209,FeedRaws!$H$6:$H$202)/$F$4","v":0},{"$f":"SUMPRODUCT(AC13:AC209,FeedRaws!$H$6:$H$202)/$F$4","v":0},{"$f":"SUMPRODUCT(AD13:AD209,FeedRaws!$H$6:$H$202)/$F$4","v":0},{"$f":"SUMPRODUCT(AE13:AE209,FeedRaws!$H$6:$H$202)/$F$4","v":0},{"$f":"SUMPRODUCT(AF13:AF209,FeedRaws!$H$6:$H$202)/$F$4","v":0},{"$f":"SUMPRODUCT(AG13:AG209,FeedRaws!$H$6:$H$202)/$F$4","v":0},{"$f":"SUMPRODUCT(AH13:AH209,FeedRaws!$H$6:$H$202)/$F$4","v":0},{"$f":"SUMPRODUCT(AI13:AI209,FeedRaws!$H$6:$H$202)/$F$4","v":0},{"$f":"SUMPRODUCT(AJ13:AJ209,FeedRaws!$H$6:$H$202)/$F$4","v":0},{"$f":"SUMPRODUCT(AK13:AK209,FeedRaws!$H$6:$H$202)/$F$4","v":0},{"$f":"SUMPRODUCT(AL13:AL209,FeedRaws!$H$6:$H$202)/$F$4","v":0},{"$f":"SUMPRODUCT(AM13:AM209,FeedRaws!$H$6:$H$202)/$F$4","v":0},{"$f":"SUMPRODUCT(AN13:AN209,FeedRaws!$H$6:$H$202)/$F$4","v":0},{"$f":"SUMPRODUCT(AO13:AO209,FeedRaws!$H$6:$H$202)/$F$4","v":0},{"$f":"SUMPRODUCT(AP13:AP209,FeedRaws!$H$6:$H$202)/$F$4","v":0},{"$f":"SUMPRODUCT(AQ13:AQ209,FeedRaws!$H$6:$H$202)/$F$4","v":0},{"$f":"SUMPRODUCT(AR13:AR209,FeedRaws!$H$6:$H$202)/$F$4","v":0},{"$f":"SUMPRODUCT(AS13:AS209,FeedRaws!$H$6:$H$202)/$F$4","v":0}]
[null,null,null,null,"Gross Energy MJ",{"$f":"SUMPRODUCT(F13:F209,FeedRaws!$I$6:$I$202)/$F$4","v":0},{"$f":"SUMPRODUCT(G13:G209,FeedRaws!$I$6:$I$202)/$F$4","v":0},{"$f":"SUMPRODUCT(H13:H209,FeedRaws!$I$6:$I$202)/$F$4","v":0},{"$f":"SUMPRODUCT(I13:I209,FeedRaws!$I$6:$I$202)/$F$4","v":16.863750999999997},{"$f":"SUMPRODUCT(J13:J209,FeedRaws!$I$6:$I$202)/$F$4","v":0},{"$f":"SUMPRODUCT(K13:K209,FeedRaws!$I$6:$I$202)/$F$4","v":0},{"$f":"SUMPRODUCT(L13:L209,FeedRaws!$I$6:$I$202)/$F$4","v":0},{"$f":"SUMPRODUCT(M13:M209,FeedRaws!$I$6:$I$202)/$F$4","v":16.932723999999997},{"$f":"SUMPRODUCT(N13:N209,FeedRaws!$I$6:$I$202)/$F$4","v":16.432198},{"$f":"SUMPRODUCT(O13:O209,FeedRaws!$I$6:$I$202)/$F$4","v":16.425438999999997},{"$f":"SUMPRODUCT(P13:P209,FeedRaws!$I$6:$I$202)/$F$4","v":0},{"$f":"SUMPRODUCT(Q13:Q209,FeedRaws!$I$6:$I$202)/$F$4","v":0},{"$f":"SUMPRODUCT(R13:R209,FeedRaws!$I$6:$I$202)/$F$4","v":16.208326},{"$f":"SUMPRODUCT(S13:S209,FeedRaws!$I$6:$I$202)/$F$4","v":16.352516000000001},{"$f":"SUMPRODUCT(T13:T209,FeedRaws!$I$6:$I$202)/$F$4","v":0},{"$f":"SUMPRODUCT(U13:U209,FeedRaws!$I$6:$I$202)/$F$4","v":0},{"$f":"SUMPRODUCT(V13:V209,FeedRaws!$I$6:$I$202)/$F$4","v":16.817635999999997},{"$f":"SUMPRODUCT(W13:W209,FeedRaws!$I$6:$I$202)/$F$4","v":16.940421000000001},{"$f":"SUMPRODUCT(X13:X209,FeedRaws!$I$6:$I$202)/$F$4","v":0},{"$f":"SUMPRODUCT(Y13:Y209,FeedRaws!$I$6:$I$202)/$F$4","v":0},{"$f":"SUMPRODUCT(Z13:Z209,FeedRaws!$I$6:$I$202)/$F$4","v":16.000919999999997},{"$f":"SUMPRODUCT(AA13:AA209,FeedRaws!$I$6:$I$202)/$F$4","v":15.990789999999997},{"$f":"SUMPRODUCT(AB13:AB209,FeedRaws!$I$6:$I$202)/$F$4","v":0},{"$f":"SUMPRODUCT(AC13:AC209,FeedRaws!$I$6:$I$202)/$F$4","v":0},{"$f":"SUMPRODUCT(AD13:AD209,FeedRaws!$I$6:$I$202)/$F$4","v":0},{"$f":"SUMPRODUCT(AE13:AE209,FeedRaws!$I$6:$I$202)/$F$4","v":0},{"$f":"SUMPRODUCT(AF13:AF209,FeedRaws!$I$6:$I$202)/$F$4","v":0},{"$f":"SUMPRODUCT(AG13:AG209,FeedRaws!$I$6:$I$202)/$F$4","v":0},{"$f":"SUMPRODUCT(AH13:AH209,FeedRaws!$I$6:$I$202)/$F$4","v":0},{"$f":"SUMPRODUCT(AI13:AI209,FeedRaws!$I$6:$I$202)/$F$4","v":0},{"$f":"SUMPRODUCT(AJ13:AJ209,FeedRaws!$I$6:$I$202)/$F$4","v":0},{"$f":"SUMPRODUCT(AK13:AK209,FeedRaws!$I$6:$I$202)/$F$4","v":0},{"$f":"SUMPRODUCT(AL13:AL209,FeedRaws!$I$6:$I$202)/$F$4","v":0},{"$f":"SUMPRODUCT(AM13:AM209,FeedRaws!$I$6:$I$202)/$F$4","v":0},{"$f":"SUMPRODUCT(AN13:AN209,FeedRaws!$I$6:$I$202)/$F$4","v":0},{"$f":"SUMPRODUCT(AO13:AO209,FeedRaws!$I$6:$I$202)/$F$4","v":0},{"$f":"SUMPRODUCT(AP13:AP209,FeedRaws!$I$6:$I$202)/$F$4","v":0},{"$f":"SUMPRODUCT(AQ13:AQ209,FeedRaws!$I$6:$I$202)/$F$4","v":0},{"$f":"SUMPRODUCT(AR13:AR209,FeedRaws!$I$6:$I$202)/$F$4","v":0},{"$f":"SUMPRODUCT(AS13:AS209,FeedRaws!$I$6:$I$202)/$F$4","v":0}]
[null,null,null,null,"Crupe Protein %",{"$f":"SUMPRODUCT(F13:F209,FeedRaws!$L$6:$L$202)/$F$4","v":0},{"$f":"SUMPRODUCT(G13:G209,FeedRaws!$L$6:$L$202)/$F$4","v":0},{"$f":"SUMPRODUCT(H13:H209,FeedRaws!$L$6:$L$202)/$F$4","v":0},{"$f":"SUMPRODUCT(I13:I209,FeedRaws!$L$6:$L$202)/$F$4","v":22.710238},{"$f":"SUMPRODUCT(J13:J209,FeedRaws!$L$6:$L$202)/$F$4","v":0},{"$f":"SUMPRODUCT(K13:K209,FeedRaws!$L$6:$L$202)/$F$4","v":0},{"$f":"SUMPRODUCT(L13:L209,FeedRaws!$L$6:$L$202)/$F$4","v":0},{"$f":"SUMPRODUCT(M13:M209,FeedRaws!$L$6:$L$202)/$F$4","v":19.838609999999999},{"$f":"SUMPRODUCT(N13:N209,FeedRaws!$L$6:$L$202)/$F$4","v":19.402609999999999},{"$f":"SUMPRODUCT(O13:O209,FeedRaws!$L$6:$L$202)/$F$4","v":18.979276000000002},{"$f":"SUMPRODUCT(P13:P209,FeedRaws!$L$6:$L$202)/$F$4","v":0},{"$f":"SUMPRODUCT(Q13:Q209,FeedRaws!$L$6:$L$202)/$F$4","v":0},{"$f":"SUMPRODUCT(R13:R209,FeedRaws!$L$6:$L$202)/$F$4","v":18.099},{"$f":"SUMPRODUCT(S13:S209,FeedRaws!$L$6:$L$202)/$F$4","v":18.542999999999999},{"$f":"SUMPRODUCT(T13:T209,FeedRaws!$L$6:$L$202)/$F$4","v":0},{"$f":"SUMPRODUCT(U13:U209,FeedRaws!$L$6:$L$202)/$F$4","v":0},{"$f":"SUMPRODUCT(V13:V209,FeedRaws!$L$6:$L$202)/$F$4","v":17.216890999999997},{"$f":"SUMPRODUCT(W13:W209,FeedRaws!$L$6:$L$202)/$F$4","v":17.325240999999998},{"$f":"SUMPRODUCT(X13:X209,FeedRaws!$L$6:$L$202)/$F$4","v":0},{"$f":"SUMPRODUCT(Y13:Y209,FeedRaws!$L$6:$L$202)/$F$4","v":0},{"$f":"SUMPRODUCT(Z13:Z209,FeedRaws!$L$6:$L$202)/$F$4","v":14.616879999999998},{"$f":"SUMPRODUCT(AA13:AA209,FeedRaws!$L$6:$L$202)/$F$4","v":14.602659999999998},{"$f":"SUMPRODUCT(AB13:AB209,FeedRaws!$L$6:$L$202)/$F$4","v":0},{"$f":"SUMPRODUCT(AC13:AC209,FeedRaws!$L$6:$L$202)/$F$4","v":0},{"$f":"SUMPRODUCT(AD13:AD209,FeedRaws!$L$6:$L$202)/$F$4","v":0},{"$f":"SUMPRODUCT(AE13:AE209,FeedRaws!$L$6:$L$202)/$F$4","v":0},{"$f":"SUMPRODUCT(AF13:AF209,FeedRaws!$L$6:$L$202)/$F$4","v":0},{"$f":"SUMPRODUCT(AG13:AG209,FeedRaws!$L$6:$L$202)/$F$4","v":0},{"$f":"SUMPRODUCT(AH13:AH209,FeedRaws!$L$6:$L$202)/$F$4","v":0},{"$f":"SUMPRODUCT(AI13:AI209,FeedRaws!$L$6:$L$202)/$F$4","v":0},{"$f":"SUMPRODUCT(AJ13:AJ209,FeedRaws!$L$6:$L$202)/$F$4","v":0},{"$f":"SUMPRODUCT(AK13:AK209,FeedRaws!$L$6:$L$202)/$F$4","v":0},{"$f":"SUMPRODUCT(AL13:AL209,FeedRaws!$L$6:$L$202)/$F$4","v":0},{"$f":"SUMPRODUCT(AM13:AM209,FeedRaws!$L$6:$L$202)/$F$4","v":0},{"$f":"SUMPRODUCT(AN13:AN209,FeedRaws!$L$6:$L$202)/$F$4","v":0},{"$f":"SUMPRODUCT(AO13:AO209,FeedRaws!$L$6:$L$202)/$F$4","v":0},{"$f":"SUMPRODUCT(AP13:AP209,FeedRaws!$L$6:$L$202)/$F$4","v":0},{"$f":"SUMPRODUCT(AQ13:AQ209,FeedRaws!$L$6:$L$202)/$F$4","v":0},{"$f":"SUMPRODUCT(AR13:AR209,FeedRaws!$L$6:$L$202)/$F$4","v":0},{"$f":"SUMPRODUCT(AS13:AS209,FeedRaws!$L$6:$L$202)/$F$4","v":0}]
[null,null,null,null,"Total Manure Solids %",{"$f":"(SUMPRODUCT(FeedRaws!$H$6:$H$202,Feeds!F13:F209)/$F$4)-SUMPRODUCT(FeedRaws!$H$6:$H$202,Feeds!F13:F209,FeedRaws!$K$6:$K$202)/$F$4","v":0},{"$f":"(SUMPRODUCT(FeedRaws!$H$6:$H$202,Feeds!G13:G209)/$F$4)-SUMPRODUCT(FeedRaws!$H$6:$H$202,Feeds!G13:G209,FeedRaws!$K$6:$K$202)/$F$4","v":0},{"$f":"(SUMPRODUCT(FeedRaws!$H$6:$H$202,Feeds!H13:H209)/$F$4)-SUMPRODUCT(FeedRaws!$H$6:$H$202,Feeds!H13:H209,FeedRaws!$K$6:$K$202)/$F$4","v":0},{"$f":"(SUMPRODUCT(FeedRaws!$H$6:$H$202,Feeds!I13:I209)/$F$4)-SUMPRODUCT(FeedRaws!$H$6:$H$202,Feeds!I13:I209,FeedRaws!$K$6:$K$202)/$F$4","v":10.306505519446148},{"$f":"(SUMPRODUCT(FeedRaws!$H$6:$H$202,Feeds!J13:J209)/$F$4)-SUMPRODUCT(FeedRaws!$H$6:$H$202,Feeds!J13:J209,FeedRaws!$K$6:$K$202)/$F$4","v":0},{"$f":"(SUMPRODUCT(FeedRaws!$H$6:$H$202,Feeds!K13:K209)/$F$4)-SUMPRODUCT(FeedRaws!$H$6:$H$202,Feeds!K13:K209,FeedRaws!$K$6:$K$202)/$F$4","v":0},{"$f":"(SUMPRODUCT(FeedRaws!$H$6:$H$202,Feeds!L13:L209)/$F$4)-SUMPRODUCT(FeedRaws!$H$6:$H$202,Feeds!L13:L209,FeedRaws!$K$6:$K$202)/$F$4","v":0},{"$f":"(SUMPRODUCT(FeedRaws!$H$6:$H$202,Feeds!M13:M209)/$F$4)-SUMPRODUCT(FeedRaws!$H$6:$H$202,Feeds!M13:M209,FeedRaws!$K$6:$K$202)/$F$4","v":11.799491184718477},{"$f":"(SUMPRODUCT(FeedRaws!$H$6:$H$202,Feeds!N13:N209)/$F$4)-SUMPRODUCT(FeedRaws!$H$6:$H$202,Feeds!N13:N209,FeedRaws!$K$6:$K$202)/$F$4","v":11.791621035386243},{"$f":"(SUMPRODUCT(FeedRaws!$H$6:$H$202,Feeds!O13:O209)/$F$4)-SUMPRODUCT(FeedRaws!$H$6:$H$202,Feeds!O13:O209,FeedRaws!$K$6:$K$202)/$F$4","v":13.072215842407587},{"$f":"(SUMPRODUCT(FeedRaws!$H$6:$H$202,Feeds!P13:P209)/$F$4)-SUMPRODUCT(FeedRaws!$H$6:$H$202,Feeds!P13:P209,FeedRaws!$K$6:$K$202)/$F$4","v":0},{"$f":"(SUMPRODUCT(FeedRaws!$H$6:$H$202,Feeds!Q13:Q209)/$F$4)-SUMPRODUCT(FeedRaws!$H$6:$H$202,Feeds!Q13:Q209,FeedRaws!$K$6:$K$202)/$F$4","v":0},{"$f":"(SUMPRODUCT(FeedRaws!$H$6:$H$202,Feeds!R13:R209)/$F$4)-SUMPRODUCT(FeedRaws!$H$6:$H$202,Feeds!R13:R209,FeedRaws!$K$6:$K$202)/$F$4","v":14.483534400988233},{"$f":"(SUMPRODUCT(FeedRaws!$H$6:$H$202,Feeds!S13:S209)/$F$4)-SUMPRODUCT(FeedRaws!$H$6:$H$202,Feeds!S13:S209,FeedRaws!$K$6:$K$202)/$F$4","v":13.055314216557292},{"$f":"(SUMPRODUCT(FeedRaws!$H$6:$H$202,Feeds!T13:T209)/$F$4)-SUMPRODUCT(FeedRaws!$H$6:$H$202,Feeds!T13:T209,FeedRaws!$K$6:$K$202)/$F$4","v":0},{"$f":"(SUMPRODUCT(FeedRaws!$H$6:$H$202,Feeds!U13:U209)/$F$4)-SUMPRODUCT(FeedRaws!$H$6:$H$202,Feeds!U13:U209,FeedRaws!$K$6:$K$202)/$F$4","v":0},{"$f":"(SUMPRODUCT(FeedRaws!$H$6:$H$202,Feeds!V13:V209)/$F$4)-SUMPRODUCT(FeedRaws!$H$6:$H$202,Feeds!V13:V209,FeedRaws!$K$6:$K$202)/$F$4","v":14.042489174783469},{"$f":"(SUMPRODUCT(FeedRaws!$H$6:$H$202,Feeds!W13:W209)/$F$4)-SUMPRODUCT(FeedRaws!$H$6:$H$202,Feeds!W13:W209,FeedRaws!$K$6:$K$202)/$F$4","v":15.354792941265714},{"$f":"(SUMPRODUCT(FeedRaws!$H$6:$H$202,Feeds!X13:X209)/$F$4)-SUMPRODUCT(FeedRaws!$H$6:$H$202,Feeds!X13:X209,FeedRaws!$K$6:$K$202)/$F$4","v":0},{"$f":"(SUMPRODUCT(FeedRaws!$H$6:$H$202,Feeds!Y13:Y209)/$F$4)-SUMPRODUCT(FeedRaws!$H$6:$H$202,Feeds!Y13:Y209,FeedRaws!$K$6:$K$202)/$F$4","v":0},{"$f":"(SUMPRODUCT(FeedRaws!$H$6:$H$202,Feeds!Z13:Z209)/$F$4)-SUMPRODUCT(FeedRaws!$H$6:$H$202,Feeds!Z13:Z209,FeedRaws!$K$6:$K$202)/$F$4","v":17.322912146649628},{"$f":"(SUMPRODUCT(FeedRaws!$H$6:$H$202,Feeds!AA13:AA209)/$F$4)-SUMPRODUCT(FeedRaws!$H$6:$H$202,Feeds!AA13:AA209,FeedRaws!$K$6:$K$202)/$F$4","v":17.51129867339715},{"$f":"(SUMPRODUCT(FeedRaws!$H$6:$H$202,Feeds!AB13:AB209)/$F$4)-SUMPRODUCT(FeedRaws!$H$6:$H$202,Feeds!AB13:AB209,FeedRaws!$K$6:$K$202)/$F$4","v":0},{"$f":"(SUMPRODUCT(FeedRaws!$H$6:$H$202,Feeds!AC13:AC209)/$F$4)-SUMPRODUCT(FeedRaws!$H$6:$H$202,Feeds!AC13:AC209,FeedRaws!$K$6:$K$202)/$F$4","v":0},{"$f":"(SUMPRODUCT(FeedRaws!$H$6:$H$202,Feeds!AD13:AD209)/$F$4)-SUMPRODUCT(FeedRaws!$H$6:$H$202,Feeds!AD13:AD209,FeedRaws!$K$6:$K$202)/$F$4","v":0},{"$f":"(SUMPRODUCT(FeedRaws!$H$6:$H$202,Feeds!AE13:AE209)/$F$4)-SUMPRODUCT(FeedRaws!$H$6:$H$202,Feeds!AE13:AE209,FeedRaws!$K$6:$K$202)/$F$4","v":0},{"$f":"(SUMPRODUCT(FeedRaws!$H$6:$H$202,Feeds!AF13:AF209)/$F$4)-SUMPRODUCT(FeedRaws!$H$6:$H$202,Feeds!AF13:AF209,FeedRaws!$K$6:$K$202)/$F$4","v":0},{"$f":"(SUMPRODUCT(FeedRaws!$H$6:$H$202,Feeds!AG13:AG209)/$F$4)-SUMPRODUCT(FeedRaws!$H$6:$H$202,Feeds!AG13:AG209,FeedRaws!$K$6:$K$202)/$F$4","v":0},{"$f":"(SUMPRODUCT(FeedRaws!$H$6:$H$202,Feeds!AH13:AH209)/$F$4)-SUMPRODUCT(FeedRaws!$H$6:$H$202,Feeds!AH13:AH209,FeedRaws!$K$6:$K$202)/$F$4","v":0},{"$f":"(SUMPRODUCT(FeedRaws!$H$6:$H$202,Feeds!AI13:AI209)/$F$4)-SUMPRODUCT(FeedRaws!$H$6:$H$202,Feeds!AI13:AI209,FeedRaws!$K$6:$K$202)/$F$4","v":0},{"$f":"(SUMPRODUCT(FeedRaws!$H$6:$H$202,Feeds!AJ13:AJ209)/$F$4)-SUMPRODUCT(FeedRaws!$H$6:$H$202,Feeds!AJ13:AJ209,FeedRaws!$K$6:$K$202)/$F$4","v":0},{"$f":"(SUMPRODUCT(FeedRaws!$H$6:$H$202,Feeds!AK13:AK209)/$F$4)-SUMPRODUCT(FeedRaws!$H$6:$H$202,Feeds!AK13:AK209,FeedRaws!$K$6:$K$202)/$F$4","v":0},{"$f":"(SUMPRODUCT(FeedRaws!$H$6:$H$202,Feeds!AL13:AL209)/$F$4)-SUMPRODUCT(FeedRaws!$H$6:$H$202,Feeds!AL13:AL209,FeedRaws!$K$6:$K$202)/$F$4","v":0},{"$f":"(SUMPRODUCT(FeedRaws!$H$6:$H$202,Feeds!AM13:AM209)/$F$4)-SUMPRODUCT(FeedRaws!$H$6:$H$202,Feeds!AM13:AM209,FeedRaws!$K$6:$K$202)/$F$4","v":0},{"$f":"(SUMPRODUCT(FeedRaws!$H$6:$H$202,Feeds!AN13:AN209)/$F$4)-SUMPRODUCT(FeedRaws!$H$6:$H$202,Feeds!AN13:AN209,FeedRaws!$K$6:$K$202)/$F$4","v":0},{"$f":"(SUMPRODUCT(FeedRaws!$H$6:$H$202,Feeds!AO13:AO209)/$F$4)-SUMPRODUCT(FeedRaws!$H$6:$H$202,Feeds!AO13:AO209,FeedRaws!$K$6:$K$202)/$F$4","v":0},{"$f":"(SUMPRODUCT(FeedRaws!$H$6:$H$202,Feeds!AP13:AP209)/$F$4)-SUMPRODUCT(FeedRaws!$H$6:$H$202,Feeds!AP13:AP209,FeedRaws!$K$6:$K$202)/$F$4","v":0},{"$f":"(SUMPRODUCT(FeedRaws!$H$6:$H$202,Feeds!AQ13:AQ209)/$F$4)-SUMPRODUCT(FeedRaws!$H$6:$H$202,Feeds!AQ13:AQ209,FeedRaws!$K$6:$K$202)/$F$4","v":0},{"$f":"(SUMPRODUCT(FeedRaws!$H$6:$H$202,Feeds!AR13:AR209)/$F$4)-SUMPRODUCT(FeedRaws!$H$6:$H$202,Feeds!AR13:AR209,FeedRaws!$K$6:$K$202)/$F$4","v":0},{"$f":"(SUMPRODUCT(FeedRaws!$H$6:$H$202,Feeds!AS13:AS209)/$F$4)-SUMPRODUCT(FeedRaws!$H$6:$H$202,Feeds!AS13:AS209,FeedRaws!$K$6:$K$202)/$F$4","v":0}]
[]
[]
[null,null,null,null,null,null,{"$f":"F8","v":"Sucker"},null,null,null,{"$f":"J8","v":"Weaner"},null,null,null,{"$f":"N8","v":"Grower"},null,null,null,{"$f":"R8","v":"Finisher"},null,null,null,{"$f":"V8","v":"LacSow"},null,null,null,{"$f":"Z8","v":"DrySow"},null,null,null,{"$f":"AD8","v":0},null,null,null,{"$f":"AH8","v":0},null,null,null,{"$f":"AL8","v":0},null,null,null,{"$f":"AP8","v":0}]
[null,null,null,null,null,"TS %",{"$f":"SUMPRODUCT(F$11:I$11,F212:I212)","v":89.27225},null,null,"TS %",{"$f":"SUMPRODUCT(J$11:M$11,J212:M212)","v":88.629750000000001},null,null,"TS %",{"$f":"SUMPRODUCT(N$11:Q$11,N212:Q212)","v":88.465099999999993},null,null,"TS %",{"$f":"SUMPRODUCT(R$11:U$11,R212:U212)","v":88.42295},null,null,"TS %",{"$f":"SUMPRODUCT(V$11:Y$11,V212:Y212)","v":88.686399999999992},null,null,"TS %",{"$f":"SUMPRODUCT(Z$11:AC$11,Z212:AC212)","v":88.380349999999993},null,null,"TS %",{"$f":"SUMPRODUCT(AD$11:AG$11,AD212:AG212)","v":0},null,null,"TS %",{"$f":"SUMPRODUCT(AH$11:AK$11,AH212:AK212)","v":0},null,null,"TS %",{"$f":"SUMPRODUCT(AL$11:AO$11,AL212:AO212)","v":0},null,null,"TS %",{"$f":"SUMPRODUCT(AP$11:AS$11,AP212:AS212)","v":0}]
[null,null,null,null,null,"FS %",5.3697400000000002,null,null,"FS %",4.5475400000000006,null,null,"FS %",4.5855565,null,null,"FS %",4.747395,null,null,"FS %",4.3483875000000003,null,null,"FS %",4.5741724999999995,null,null,"FS %",0,null,null,"FS %",0,null,null,"FS %",0,null,null,"FS %",0]
[null,null,null,null,null,"VS%",83.902510000000007,null,null,"VS%",84.082210000000003,null,null,"VS%",83.879543499999983,null,null,"VS%",83.675555000000003,null,null,"VS%",84.338012499999991,null,null,"VS%",83.80617749999999,null,null,"VS%",0,null,null,"VS%",0,null,null,"VS%",0,null,null,"VS%",0]
[null,null,null,null,null,"N",3.6336380799999994,null,null,"N",3.1741776000000006,null,null,"N",3.0705508799999999,null,null,"N",2.9313600000000006,null,null,"N",2.7633705600000003,null,null,"N",2.3375632,null,null,"N",0,null,null,"N",0,null,null,"N",0,null,null,"N",0]
[null,null,null,null,null,"P",0.84895000000000009,null,null,"P",0.70373799999999997,null,null,"P",0.68069550000000012,null,null,"P",0.70003099999999996,null,null,"P",0.64300899999999994,null,null,"P",0.71161000000000008,null,null,"P",0,null,null,"P",0,null,null,"P",0,null,null,"P",0]
[null,null,null,null,null,"K",0.65817499999999995,null,null,"K",0.61284700000000003,null,null,"K",0.56305000000000005,null,null,"K",0.57603650000000006,null,null,"K",0.57413549999999991,null,null,"K",0.5120825,null,null,"K",0,null,null,"K",0,null,null,"K",0,null,null,"K",0]
[null,null,null,null,null,"DM",89.27225,null,null,"DM",88.629750000000001,null,null,"DM",88.465099999999993,null,null,"DM",88.42295,null,null,"DM",88.686399999999992,null,null,"DM",88.380349999999993,null,null,"DM",0,null,null,"DM",0,null,null,"DM",0,null,null,"DM",0]
[null,null,null,null,null,"GE",16.863750999999997,null,null,"GE",16.932723999999997,null,null,"GE",16.428818499999998,null,null,"GE",16.280421,null,null,"GE",16.879028499999997,null,null,"GE",15.995854999999997,null,null,"GE",0,null,null,"GE",0,null,null,"GE",0,null,null,"GE",0]
[null,null,null,null,null,"CP",22.710238,null,null,"CP",19.838609999999999,null,null,"CP",19.190943000000001,null,null,"CP",18.320999999999998,null,null,"CP",17.271065999999998,null,null,"CP",14.609769999999997,null,null,"CP",0,null,null,"CP",0,null,null,"CP",0,null,null,"CP",0]
[null,null,null,null,null,"TS Mannure %",10.306505519446148,null,null,"TS %",11.799491184718477,null,null,"TS %",12.431918438896915,null,null,"TS %",13.769424308772763,null,null,"TS %",14.698641058024592,null,null,"TS %",17.417105410023389,null,null,"TS %",0,null,null,"TS %",0,null,null,"TS %",0,null,null,"TS %",0]